BDBM26718 N-[4-(6-methyl-1,3-benzothiazol-2-yl)phenyl]-1-(thiophene-2-sulfonyl)piperidine-3-carboxamide::benzothiazole analogue, 15a
SMILES Cc1ccc2nc(sc2c1)-c1ccc(NC(=O)C2CCCN(C2)S(=O)(=O)c2cccs2)cc1
InChI Key InChIKey=ZSRPHOWZPKMZJN-UHFFFAOYSA-N
Data  1 IC50
  Tab Delimited (TSV)   2D SDfile   Computed 3D by Vconf -m prep SDfile
Find this compound or compounds like it in BindingDB:
Activity Spreadsheet -- Enzyme Inhibition Constant Data from BindingDB
Found 1 hit for monomerid = 26718
TargetFatty-acid amide hydrolase 1 [30-579](Rattus norvegicus (rat))
Abbott Laboratories
LigandPNGBDBM26718(N-[4-(6-methyl-1,3-benzothiazol-2-yl)phenyl]-1-(th...)
Affinity DataIC50: >1.00E+4nMpH: 8.0 T: 2°C. Assay description: [3H]anandamide was incubated with membranes to produce radiolabeled ethanolamine and unlabeled arachidonic acid. Charcoal selectively binds anandamid...
In DepthDetails ArticlePubMed