BDBM267387 3-(difluoromethoxy)-5-(6-oxo-1-((6-oxo-1,6-dihydropyridazin-3-yl)methyl)-4-(trifluoromethyl)-1,6-dihydropyrimidin-5-yloxy)benzonitrile::US10189831, Example 163::US9718819, 163
SMILES FC(F)Oc1cc(Oc2c(ncn(Cc3ccc(=O)[nH]n3)c2=O)C(F)(F)F)cc(c1)C#N
InChI Key InChIKey=BKLUXGWPTJCJJG-UHFFFAOYSA-N
Data  2 IC50
  Tab Delimited (TSV)   2D SDfile   Computed 3D by Vconf -m prep SDfile
Find this compound or compounds like it in BindingDB:
Activity Spreadsheet -- Enzyme Inhibition Constant Data from BindingDB
Found 2 hits for monomerid = 267387
TargetGag-Pol polyprotein(Human immunodeficiency virus type 1 group M subtyp...)
Merck Sharp & Dohme
US Patent
LigandPNGBDBM267387(3-(difluoromethoxy)-5-(6-oxo-1-((6-oxo-1,6-dihydro...)
Affinity DataIC50:  22nM. Assay description: The heterodimeric nucleic acid substrate used in the HIV-1 RT polymerase reactions was generated by annealing the DNA primer, biotinylated pD500 (Sig...
Ligand InfoPC cidPC sid
In DepthDetails US Patent
TargetGag-Pol polyprotein(Human immunodeficiency virus type 1 group M subtyp...)
Merck Sharp & Dohme
US Patent
LigandPNGBDBM267387(3-(difluoromethoxy)-5-(6-oxo-1-((6-oxo-1,6-dihydro...)
Affinity DataIC50:  22nMpH: 7.8 T: 2°C. Assay description: The heterodimeric nucleic acid substrate used in the HIV-1 RT polymerase reactions was generated by annealing the DNA primer, biotinylated pD500 (Sig...
Ligand InfoPC cidPC sid
In DepthDetails US Patent