BDBM267541 (R)-phenyl 3-(8-amino-1-(4-(4-cyclopropylpyridin-2-ylcarbamoyl)phenyl)imidazo [1,5-a]pyrazin-3-yl)piperidine-1-carboxylate ::US9718828, Example, 123
SMILES Nc1nccn2c(nc(-c3ccc(cc3)C(=O)Nc3cc(ccn3)C3CC3)c12)[C@@H]1CCCN(C1)C(=O)C(=O)c1ccco1
InChI Key InChIKey=RIZBNVTVOCBRML-HSZRJFAPSA-N
Data  1 EC50
  Tab Delimited (TSV)   2D SDfile   Computed 3D by Vconf -m prep SDfile
Find this compound or compounds like it in BindingDB:
Activity Spreadsheet -- Enzyme Inhibition Constant Data from BindingDB
Found 1 hit for monomerid = 267541
TargetTyrosine-protein kinase BTK(Homo sapiens (Human))
Merck Sharp & Dohme
US Patent
LigandPNGBDBM267541((R)-phenyl 3-(8-amino-1-(4-(4-cyclopropylpyridin-2...)
Affinity DataEC50:  55nMpH: 7.2 T: 2°C. Assay description: Btk enzyme activity is measured using the IMAP (immobilized metal ion affinity-based fluorescence polarization) assay as outlined below. Btk enzyme (...
Ligand InfoPC cidPC sid
In DepthDetails US Patent