BDBM267590 (trans)-ethyl 5-(8-amino-1-(4-(4-(trifluoromethyl)pyridin-2-ylcarbamoyl)phenyl)imidazo [1,5-a]pyrazin-3-yl)-2-methylpiperidine-1-carboxylate::US9718828, Example, 183
SMILES COCCC(=O)N1C[C@@H](CC[C@@H]1C)c1nc(-c2ccc(cc2)C(=O)Nc2cc(ccn2)C2CC2)c2c(N)nccn12
InChI Key InChIKey=RDHFWEBHRFQPOX-YADARESESA-N
Data  1 EC50
  Tab Delimited (TSV)   2D SDfile   Computed 3D by Vconf -m prep SDfile
Find this compound or compounds like it in BindingDB:
Activity Spreadsheet -- Enzyme Inhibition Constant Data from BindingDB
Found 1 hit for monomerid = 267590
TargetTyrosine-protein kinase BTK(Homo sapiens (Human))
Merck Sharp & Dohme
US Patent
LigandPNGBDBM267590((trans)-ethyl 5-(8-amino-1-(4-(4-(trifluoromethyl)...)
Affinity DataEC50: <10nMpH: 7.2 T: 2°C. Assay description: Btk enzyme activity is measured using the IMAP (immobilized metal ion affinity-based fluorescence polarization) assay as outlined below. Btk enzyme (...
Ligand InfoPC cidPC sid
In DepthDetails US Patent