BDBM267672 (R)-4-(4-amino-1-(1-(2-fluoro-2-methylpropanoyl)piperidin-3-yl)-1H-pyrazolo[3,4-d]pyrimidin-3-yl)-N-(4-(trifluoromethyl)pyridin-2-yl)benzamide::US9718828, Example, 271
SMILES CCC(=O)N1CCC[C@H](C1)n1nc(-c2ccc(cc2)C(=O)Nc2cc(ccn2)C(F)(F)F)c2c(N)ncnc12
InChI Key InChIKey=SESKTYSFDOAGCV-GOSISDBHSA-N
Data  1 EC50
  Tab Delimited (TSV)   2D SDfile   Computed 3D by Vconf -m prep SDfile
Find this compound or compounds like it in BindingDB:
Activity Spreadsheet -- Enzyme Inhibition Constant Data from BindingDB
Found 1 hit for monomerid = 267672
TargetTyrosine-protein kinase BTK(Homo sapiens (Human))
Merck Sharp & Dohme
US Patent
LigandPNGBDBM267672((R)-4-(4-amino-1-(1-(2-fluoro-2-methylpropanoyl)pi...)
Affinity DataEC50: <10nMpH: 7.2 T: 2°C. Assay description: Btk enzyme activity is measured using the IMAP (immobilized metal ion affinity-based fluorescence polarization) assay as outlined below. Btk enzyme (...
Ligand InfoPC cidPC sid
In DepthDetails US Patent