BDBM267718 (R)-4-(8-amino-3-(1-(3-methyloxetane-3-carbonyl)piperidin-3-yl)-5-phenethylimidazo[1,5-a]pyrazin-1-yl)-N-(4-(trifluoromethyl)pyridin-2-yl)benzamide::US9718828, Example, 320
SMILES COc1cccc(c1)-c1cnc(N)c2c(nc([C@@H]3CCCN(C3)C(=O)C3(C)COC3)n12)-c1ccc(cc1)C(=O)Nc1cc(ccn1)C(F)(F)F
InChI Key InChIKey=CQWUFGIUWVDAFE-XMMPIXPASA-N
Data  1 EC50
  Tab Delimited (TSV)   2D SDfile   Computed 3D by Vconf -m prep SDfile
Find this compound or compounds like it in BindingDB:
Activity Spreadsheet -- Enzyme Inhibition Constant Data from BindingDB
Found 1 hit for monomerid = 267718
TargetTyrosine-protein kinase BTK(Homo sapiens (Human))
Merck Sharp & Dohme
US Patent
LigandPNGBDBM267718((R)-4-(8-amino-3-(1-(3-methyloxetane-3-carbonyl)pi...)
Affinity DataEC50:  55nMpH: 7.2 T: 2°C. Assay description: Btk enzyme activity is measured using the IMAP (immobilized metal ion affinity-based fluorescence polarization) assay as outlined below. Btk enzyme (...
Ligand InfoPC cidPC sid
In DepthDetails US Patent