BDBM26776 3-(1,1-dioxo-1,2-thiazinan-2-yl)-5-ethoxy-N-[(2S,3R)-3-hydroxy-1-phenyl-4-({[3-(trifluoromethoxy)phenyl]methyl}amino)butan-2-yl]benzamide::hydroxy ethylamine (HEA), 10
SMILES CCOc1cc(cc(c1)C(=O)N[C@@H](Cc1ccccc1)[C@H](O)CNCc1cccc(OC(F)(F)F)c1)N1CCCCS1(=O)=O
InChI Key InChIKey=YEZDYUAEDBVCGS-URLMMPGGSA-N
Data  3 IC50
  Tab Delimited (TSV)   2D SDfile   Computed 3D by Vconf -m prep SDfile
Find this compound or compounds like it in BindingDB:
Activity Spreadsheet -- Enzyme Inhibition Constant Data from BindingDB
Found 3 hits for monomerid = 26776
TargetBeta-secretase 1(Homo sapiens (Human))
Gsk
LigandPNGBDBM26776(3-(1,1-dioxo-1,2-thiazinan-2-yl)-5-ethoxy-N-[(2S,3...)
Affinity DataIC50:  5nMpH: 4.5 T: 2°C. Assay description: Enzyme activity and inhibition were assayed using a fluorescent FAM-[SEVNLDAEFK]-TAMRA substrate. Control reactions with no enzyme were included in e...
In DepthDetails ArticlePubMed
TargetCathepsin D(Homo sapiens (Human))
Gsk
LigandPNGBDBM26776(3-(1,1-dioxo-1,2-thiazinan-2-yl)-5-ethoxy-N-[(2S,3...)
Affinity DataIC50:  6.17E+3nM. Assay description: Enzyme activity and inhibition were assayed using a fluorescent FAM-[SEVNLDAEFK]-TAMRA substrate. Control reactions with no enzyme were included in e...
In DepthDetails ArticlePubMed
TargetBeta-secretase 2(Homo sapiens (Human))
Gsk
LigandPNGBDBM26776(3-(1,1-dioxo-1,2-thiazinan-2-yl)-5-ethoxy-N-[(2S,3...)
Affinity DataIC50:  760nM. Assay description: Enzyme activity and inhibition were assayed using a fluorescent FAM-[SEVNLDAEFK]-TAMRA substrate. Control reactions with no enzyme were included in e...
In DepthDetails ArticlePubMed