BDBM269672 (2S,3R)-N-(4-(2,6-dimethoxyphenyl)-5-(6-(2-hydroxyethoxy)-2-pyridinyl)-4H-1,2,4-triazol-3-yl)-3-(5-fluoro-2-pyrimidinyl)-2-butanesulfonamide::US10058550, Example 186.0::US10221162, Example 186.0::US9845310, Example 186.0
SMILES COc1cccc(OC)c1-n1c(NS(=O)(=O)[C@@H](C)[C@H](C)c2ncc(F)cn2)nnc1-c1cccc(OCCO)n1
InChI Key InChIKey=XBGWPZNUIDGNJI-HOTGVXAUSA-N
Data  3 EC50
  Tab Delimited (TSV)   2D SDfile   Computed 3D by Vconf -m prep SDfile
Find this compound or compounds like it in BindingDB:
Activity Spreadsheet -- Enzyme Inhibition Constant Data from BindingDB
Found 3 hits for monomerid = 269672
TargetApelin receptor(Homo sapiens (Human))
Amgen
US Patent
LigandPNGBDBM269672((2S,3R)-N-(4-(2,6-dimethoxyphenyl)-5-(6-(2-hydroxy...)
Affinity DataEC50:  0.120nMpH: 7.5Assay Description:The human APJ receptor was cloned by polymerase chain reaction and the gene encoding the receptor was subcloned in pFLAG-CMV¿-3 expression vector (Si...
Ligand InfoPC cidPC sid
In DepthDetails US Patent
TargetApelin receptor(Homo sapiens (Human))
Amgen
US Patent
LigandPNGBDBM269672((2S,3R)-N-(4-(2,6-dimethoxyphenyl)-5-(6-(2-hydroxy...)
Affinity DataEC50:  0.120nM. Assay description: The human APJ receptor was cloned by polymerase chain reaction and the gene encoding the receptor was subcloned in pFLAG-CMV-3 expression vector (Sig...
Ligand InfoPC cidPC sid
In DepthDetails US Patent
TargetApelin receptor(Homo sapiens (Human))
Amgen
US Patent
LigandPNGBDBM269672((2S,3R)-N-(4-(2,6-dimethoxyphenyl)-5-(6-(2-hydroxy...)
Affinity DataEC50:  0.120nM. Assay description: The human APJ receptor was cloned by polymerase chain reaction and the gene encoding the receptor was subcloned in pFLAG-CMV™-3 expression vector (Si...
Ligand InfoPC cidPC sid
In DepthDetails US Patent