BDBM270114 (2R,3S)-3-(5-chloro-2-pyrimidinyl)-N-(4-(2,6-dimethoxyphenyl)-5-(5-methyl-3-pyridinyl)-4H-1,2,4-triazol-3-yl)-2-butanesulfonamide, (2S,3R)-3-(5-chloro-2-pyrimidinyl)-N-(4-(2,6-dimethoxyphenyl)-5-(5-methyl-3-pyridinyl)-4H-1,2,4-triazol-3-yl)-2-butanesulfonamide::US10058550, Example 680.0::US10221162, Example 697.0::US9845310, Example 697.0
SMILES COc1cccc(OC)c1-n1c(NS(=O)(=O)[C@@H](C)[C@H](C)c2ncc(Cl)cn2)nnc1-c1cncc(C)c1
InChI Key InChIKey=MYVZVUPFFRSTIR-HOTGVXAUSA-N
Data  9 EC50
  Tab Delimited (TSV)   2D SDfile   Computed 3D by Vconf -m prep SDfile
Find this compound or compounds like it in BindingDB:
Activity Spreadsheet -- Enzyme Inhibition Constant Data from BindingDB
Found 9 hits for monomerid = 270114
TargetApelin receptor(Homo sapiens (Human))
Amgen
US Patent
LigandPNGBDBM270114((2R,3S)-3-(5-chloro-2-pyrimidinyl)-N-(4-(2,6-dimet...)
Affinity DataEC50:  0.170nMpH: 7.5Assay Description:The human APJ receptor was cloned by polymerase chain reaction and the gene encoding the receptor was subcloned in pFLAG-CMV¿-3 expression vector (Si...
Ligand InfoPC cidPC sid
In DepthDetails US Patent
TargetApelin receptor(Homo sapiens (Human))
Amgen
US Patent
LigandPNGBDBM270114((2R,3S)-3-(5-chloro-2-pyrimidinyl)-N-(4-(2,6-dimet...)
Affinity DataEC50:  0.170nM. Assay description: The human APJ receptor was cloned by polymerase chain reaction and the gene encoding the receptor was subcloned in pFLAG-CMV™-3 expression vector (Si...
Ligand InfoPC cidPC sid
In DepthDetails US Patent
TargetApelin receptor(Homo sapiens (Human))
Amgen
US Patent
LigandPNGBDBM270114((2R,3S)-3-(5-chloro-2-pyrimidinyl)-N-(4-(2,6-dimet...)
Affinity DataEC50:  3.40nM. Assay description: The human APJ receptor was cloned by polymerase chain reaction and the gene encoding the receptor was subcloned in pFLAG-CMV™-3 expression vector (Si...
Ligand InfoPC cidPC sid
In DepthDetails US Patent
TargetApelin receptor(Homo sapiens (Human))
Amgen
US Patent
LigandPNGBDBM270114((2R,3S)-3-(5-chloro-2-pyrimidinyl)-N-(4-(2,6-dimet...)
Affinity DataEC50:  0.0910nM. Assay description: The human APJ receptor was cloned by polymerase chain reaction and the gene encoding the receptor was subcloned in pFLAG-CMV™-3 expression vector (Si...
Ligand InfoPC cidPC sid
In DepthDetails US Patent
TargetApelin receptor(Homo sapiens (Human))
Amgen
US Patent
LigandPNGBDBM270114((2R,3S)-3-(5-chloro-2-pyrimidinyl)-N-(4-(2,6-dimet...)
Affinity DataEC50:  0.700nM. Assay description: The human APJ receptor was cloned by polymerase chain reaction and the gene encoding the receptor was subcloned in pFLAG-CMV-3 expression vector (Sig...
Ligand InfoPC cidPC sid
In DepthDetails US Patent
TargetApelin receptor(Homo sapiens (Human))
Amgen
US Patent
LigandPNGBDBM270114((2R,3S)-3-(5-chloro-2-pyrimidinyl)-N-(4-(2,6-dimet...)
Affinity DataEC50:  0.170nM. Assay description: The human APJ receptor was cloned by polymerase chain reaction and the gene encoding the receptor was subcloned in pFLAG-CMV-3 expression vector (Sig...
Ligand InfoPC cidPC sid
In DepthDetails US Patent
TargetApelin receptor(Homo sapiens (Human))
Amgen
US Patent
LigandPNGBDBM270114((2R,3S)-3-(5-chloro-2-pyrimidinyl)-N-(4-(2,6-dimet...)
Affinity DataEC50:  3.40nM. Assay description: The human APJ receptor was cloned by polymerase chain reaction and the gene encoding the receptor was subcloned in pFLAG-CMV-3 expression vector (Sig...
Ligand InfoPC cidPC sid
In DepthDetails US Patent
TargetApelin receptor(Homo sapiens (Human))
Amgen
US Patent
LigandPNGBDBM270114((2R,3S)-3-(5-chloro-2-pyrimidinyl)-N-(4-(2,6-dimet...)
Affinity DataEC50:  0.0910nM. Assay description: The human APJ receptor was cloned by polymerase chain reaction and the gene encoding the receptor was subcloned in pFLAG-CMV-3 expression vector (Sig...
Ligand InfoPC cidPC sid
In DepthDetails US Patent
TargetApelin receptor(Homo sapiens (Human))
Amgen
US Patent
LigandPNGBDBM270114((2R,3S)-3-(5-chloro-2-pyrimidinyl)-N-(4-(2,6-dimet...)
Affinity DataEC50:  0.700nM. Assay description: The human APJ receptor was cloned by polymerase chain reaction and the gene encoding the receptor was subcloned in pFLAG-CMV™-3 expression vector (Si...
Ligand InfoPC cidPC sid
In DepthDetails US Patent