BDBM27045 3-{[(1R,2S,5S)-3-[(2S)-2-({[(2S)-1-(1,1-dioxo-2,3-dihydro-1,2-benzothiazol-2-yl)-3,3-dimethylbutan-2-yl]carbamoyl}amino)-2-(1-methylcyclohexyl)acetyl]-6,6-dimethyl-3-azabicyclo[3.1.0]hexan-2-yl]formamido}-2-oxo-N-(prop-2-en-1-yl)hexanamide::bicyclic sultam derivative, 29
SMILES CCCC(NC(=O)[C@@H]1[C@@H]2[C@H](CN1C(=O)[C@@H](NC(=O)N[C@H](CN1Cc3ccccc3S1(=O)=O)C(C)(C)C)C1(C)CCCCC1)C2(C)C)C(=O)C(=O)NCC=C
InChI Key InChIKey=FHMVXNIKYUZSEH-CPOMJBFXSA-N
Data  1 KI
  Tab Delimited (TSV)   2D SDfile   Computed 3D by Vconf -m prep SDfile
Find this compound or compounds like it in BindingDB:
Activity Spreadsheet -- Enzyme Inhibition Constant Data from BindingDB
Found 1 hit for monomerid = 27045
TargetGenome polyprotein(Hepatitis C virus (HCV genotype 1a, isolate H))
Schering-Plough Research Institute
LigandPNGBDBM27045(3-{[(1R,2S,5S)-3-[(2S)-2-({[(2S)-1-(1,1-dioxo-2,3-...)
Affinity DataKi:  5nM ΔG°:  -11.5kcal/molepH: 6.5 T: 2°C. Assay description: Proteolytic cleavage of the ester linkage between the Nva (L-norvaline) and the chromophore (PAP) was monitored for change in absorbance at 370 nm. I...
In DepthDetails ArticlePubMed