BDBM272314 US10065950, Example 156
SMILES CC(C)N1[C@H](C)Cn2cc(-c3nnc(Cc4ccc(F)cc4F)s3)c(=O)c(O)c2C1=O
InChI Key InChIKey=DAIBROOJBOERMN-LLVKDONJSA-N
Data  1 IC50
  Tab Delimited (TSV)   2D SDfile   Computed 3D by Vconf -m prep SDfile
Find this compound or compounds like it in BindingDB:
Activity Spreadsheet -- Enzyme Inhibition Constant Data from BindingDB
Found 1 hit for monomerid = 272314
TargetVirion infectivity factor(Human immunodeficiency virus type 1 group M subtyp...)
Japan Tobacco
US Patent
LigandPNGBDBM272314(US10065950, Example 156)
Affinity DataIC50:  4.60nMT: 2°C. Assay description: The donor DNA was diluted with TE buffer to 20 nM, of which 50 μL was added to each well of streptavidin-coated black plate (manufactured by PIA...
Ligand InfoPC cidPC sid
In DepthDetails US Patent