BDBM272572 US10065963, Compound 32b::US10376513, Example 347::US10646492, Example 345::US10675284, Example 32b::US9932341, Example 346
SMILES CCOc1c(cc(Cl)c(F)c1[C@H]1CNC(=O)C1)[C@@H](C)n1nc(C)c2c(N)ncnc12
InChI Key InChIKey=ZQPDJCIXJHUERQ-GHMZBOCLSA-N
Data  6 IC50
  Tab Delimited (TSV)   2D SDfile   Computed 3D by Vconf -m prep SDfile
Find this compound or compounds like it in BindingDB:
Activity Spreadsheet -- Enzyme Inhibition Constant Data from BindingDB
Found 6 hits for monomerid = 272572
LigandPNGBDBM272572(US10065963, Compound 32b | US10376513, Example 347...)
Affinity DataIC50:  32nMpH: 6.7 T: 2°C. Assay description: [γ-33P]ATP (10 mCi/mL) and Wheat Germ Agglutinin (WGA) YSi SPA Scintillation Beads was purchased from Perkin-Elmer (Waltham, Mass.). Lipid kinas...
In DepthDetails US Patent
LigandPNGBDBM272572(US10065963, Compound 32b | US10376513, Example 347...)
Affinity DataIC50: <10nMpH: 6.7 T: 2°C. Assay description: [γ-33P]ATP (10 mCi/mL) was purchased from Perkin-Elmer (Waltham, Mass.). Lipid kinase substrate, D-myo-Phosphatidylinositol 4,5-bisphosphate (Pt...
In DepthDetails US Patent
LigandPNGBDBM272572(US10065963, Compound 32b | US10376513, Example 347...)
Affinity DataIC50: <50nM. Assay description: [γ-33P]ATP (10 mCi/mL) was purchased from Perking Elmer (Waltham, Mass.). Lipid kinase substrate, D-myo-Phosphatidylinositol 4,5-bisphosphate (P...
In DepthDetails US Patent
LigandPNGBDBM272572(US10065963, Compound 32b | US10376513, Example 347...)
Affinity DataIC50: <10nM. Assay description: [γ-33P]ATP (10 mCi/mL) was purchased from Perkin-Elmer (Waltham, Mass.). Lipid kinase substrate, D-myo-Phosphatidylinositol 4,5-bisphosphate (Pt...
In DepthDetails US Patent
LigandPNGBDBM272572(US10065963, Compound 32b | US10376513, Example 347...)
Affinity DataIC50:  125nM. Assay description: The kinase reaction was conducted in polystyrene 384-well matrix white plate from Thermo Fisher Scientific in a final volume of 25 uL. Inhibitors wer...
In DepthDetails US Patent
LigandPNGBDBM272572(US10065963, Compound 32b | US10376513, Example 347...)
Affinity DataIC50: <10nM. Assay description: The kinase reaction was conducted in polystyrene 384-well matrix white plate from Thermo Fisher Scientific in a final volume of 25 uL. Inhibitors wer...
In DepthDetails US Patent