BDBM272666 2-Amino-N-(1-{8-chloro-5-[(3R)-3-fluoropyrrolidin-1- yl]imidazo[1,5-a]pyridin-6-yl}ethyl)pyrazolo[1,5- a]pyrimidine-3-carboxamide bistrifluoroacetate::US10065963, Example 75A
SMILES CC(NC(=O)c1c(N)nn2cccnc12)c1cc(Cl)c2cn[nH]c2c1N1CC[C@@H](F)C1
InChI Key
Data  3 IC50
  Tab Delimited (TSV)   2D SDfile   Computed 3D by Vconf -m prep SDfile
Find this compound or compounds like it in BindingDB:
Activity Spreadsheet -- Enzyme Inhibition Constant Data from BindingDB
Found 3 hits for monomerid = 272666
LigandPNGBDBM272666(2-Amino-N-(1-{8-chloro-5-[(3R)-3-fluoropyrrolidin-...)
Affinity DataIC50: <100nMpH: 6.7 T: 2°C. Assay description: [γ-33P]ATP (10 mCi/mL) and Wheat Germ Agglutinin (WGA) YSi SPA Scintillation Beads was purchased from Perkin-Elmer (Waltham, Mass.). Lipid kinas...
Ligand InfoPC cidPC sid
In DepthDetails US Patent
LigandPNGBDBM272666(2-Amino-N-(1-{8-chloro-5-[(3R)-3-fluoropyrrolidin-...)
Affinity DataIC50: <500nM. Assay description: To measure the Phosphorylated Ribosomal Protein S6 (RPS6) in cell lysates, THP-1 cells (Human Acute Monocytic Leukemia) are purchased from ATCC (Mana...
Ligand InfoPC cidPC sid
In DepthDetails US Patent
LigandPNGBDBM272666(2-Amino-N-(1-{8-chloro-5-[(3R)-3-fluoropyrrolidin-...)
Affinity DataIC50: <500nMpH: 6.7 T: 2°C. Assay description: [γ-33P]ATP (10 mCi/mL) and Wheat Germ Agglutinin (WGA) YSi SPA Scintillation Beads was purchased from Perkin-Elmer (Waltham, Mass.). Lipid kinas...
Ligand InfoPC cidPC sid
In DepthDetails US Patent