BDBM272715 2-Amino-N-{1-[3,4-dichloro-7-(2,2-dimethyl-1,1- dioxidothiomorpholin-4-yl)pyrazolo[1,5-a]pyridin-6- yl]ethyl}pyrazolo[1,5-a]pyrimidine-3-carboxamide trifluoroacetate::US10065963, Example 116
SMILES CC(NC(=O)c1c(N)nn2cccnc12)c1cc(Cl)c2c(Cl)n[nH]c2c1N1CCS(=O)(=O)C(C)(C)C1
InChI Key
Data  3 IC50
  Tab Delimited (TSV)   2D SDfile   Computed 3D by Vconf -m prep SDfile
Find this compound or compounds like it in BindingDB:
Activity Spreadsheet -- Enzyme Inhibition Constant Data from BindingDB
Found 3 hits for monomerid = 272715
LigandPNGBDBM272715(2-Amino-N-{1-[3,4-dichloro-7-(2,2-dimethyl-1,1- di...)
Affinity DataIC50: <100nMpH: 6.7 T: 2°C. Assay description: [γ-33P]ATP (10 mCi/mL) and Wheat Germ Agglutinin (WGA) YSi SPA Scintillation Beads was purchased from Perkin-Elmer (Waltham, Mass.). Lipid kinas...
Ligand InfoPC cidPC sid
In DepthDetails US Patent
LigandPNGBDBM272715(2-Amino-N-{1-[3,4-dichloro-7-(2,2-dimethyl-1,1- di...)
Affinity DataIC50: <500nM. Assay description: To measure the Phosphorylated Ribosomal Protein S6 (RPS6) in cell lysates, THP-1 cells (Human Acute Monocytic Leukemia) are purchased from ATCC (Mana...
Ligand InfoPC cidPC sid
In DepthDetails US Patent
LigandPNGBDBM272715(2-Amino-N-{1-[3,4-dichloro-7-(2,2-dimethyl-1,1- di...)
Affinity DataIC50: <100nMpH: 6.7 T: 2°C. Assay description: [γ-33P]ATP (10 mCi/mL) and Wheat Germ Agglutinin (WGA) YSi SPA Scintillation Beads was purchased from Perkin-Elmer (Waltham, Mass.). Lipid kinas...
Ligand InfoPC cidPC sid
In DepthDetails US Patent