BDBM272767 US10065963, Example 167
SMILES CC1CN(CCS1(=O)=O)c1c(CNC(=O)c2c(N)nn3cccnc23)cc(Cl)c2cncn12
InChI Key InChIKey=HQXWBTXZLOJXOL-UHFFFAOYSA-N
Data  3 IC50
  Tab Delimited (TSV)   2D SDfile   Computed 3D by Vconf -m prep SDfile
Find this compound or compounds like it in BindingDB:
Activity Spreadsheet -- Enzyme Inhibition Constant Data from BindingDB
Found 3 hits for monomerid = 272767
LigandPNGBDBM272767(US10065963, Example 167)
Affinity DataIC50: <100nMpH: 6.7 T: 2°C. Assay description: [γ-33P]ATP (10 mCi/mL) and Wheat Germ Agglutinin (WGA) YSi SPA Scintillation Beads was purchased from Perkin-Elmer (Waltham, Mass.). Lipid kinas...
Ligand InfoPC cidPC sid
In DepthDetails US Patent
LigandPNGBDBM272767(US10065963, Example 167)
Affinity DataIC50: <500nM. Assay description: To measure the Phosphorylated Ribosomal Protein S6 (RPS6) in cell lysates, THP-1 cells (Human Acute Monocytic Leukemia) are purchased from ATCC (Mana...
Ligand InfoPC cidPC sid
In DepthDetails US Patent
LigandPNGBDBM272767(US10065963, Example 167)
Affinity DataIC50: <500nMpH: 6.7 T: 2°C. Assay description: [γ-33P]ATP (10 mCi/mL) and Wheat Germ Agglutinin (WGA) YSi SPA Scintillation Beads was purchased from Perkin-Elmer (Waltham, Mass.). Lipid kinas...
Ligand InfoPC cidPC sid
In DepthDetails US Patent