BDBM272800 (S)-2-((1-(2- aminobenzo[d]oxazol- 5-yl)-8,9-dihydro- 7H-6-oxa-2,9a- diazabenzo[cd]azulen-4- yl)amino)propanamide::US10065970, Compound 105::US10435414, Compound 105
SMILES C[C@H](Nc1cc2OCCCn3c(nc(c1)c23)-c1ccc2oc(N)nc2c1)C(N)=O
InChI Key InChIKey=IQKZEIMSEKFAGN-JTQLQIEISA-N
Data  2 KI
  Tab Delimited (TSV)   2D SDfile   Computed 3D by Vconf -m prep SDfile
Find this compound or compounds like it in BindingDB:
Activity Spreadsheet -- Enzyme Inhibition Constant Data from BindingDB
Found 2 hits for monomerid = 272800
TargetPhosphatidylinositol 3-kinase regulatory subunit alpha(Homo sapiens (Human))
Genentech
US Patent
LigandPNGBDBM272800((S)-2-((1-(2- aminobenzo[d]oxazol- 5-yl)-8,9-dihyd...)
Affinity DataKi:  0.0320nM. Assay description: TBD
Ligand InfoPC cidPC sid
In DepthDetails US Patent
LigandPNGBDBM272800((S)-2-((1-(2- aminobenzo[d]oxazol- 5-yl)-8,9-dihyd...)
Affinity DataKi:  0.0320nM. Assay description: PI3K Binding assays are intended for determining the biochemical potency of small molecule PI3K inhibitors. The PI3K lipid kinase reaction is perform...
Ligand InfoPC cidPC sid
In DepthDetails US Patent