BDBM27299 N-{5-[1-(3,3-dimethylbutanoyl)-1H-indol-2-yl]-2,3-dihydro-1H-inden-2-yl}benzenesulfonamide::indole derivative, 21
SMILES CC(C)(C)CC(=O)n1c(cc2ccccc12)-c1ccc2CC(Cc2c1)NS(=O)(=O)c1ccccc1
InChI Key InChIKey=HMFYVUXCNMFRMS-UHFFFAOYSA-N
Data  1 EC50
  Tab Delimited (TSV)   2D SDfile   Computed 3D by Vconf -m prep SDfile
Find this compound or compounds like it in BindingDB:
Activity Spreadsheet -- Enzyme Inhibition Constant Data from BindingDB
Found 1 hit for monomerid = 27299
TargetOxysterols receptor LXR-beta(Homo sapiens (Human))
Tanabe Research Laboratories Usa
LigandPNGBDBM27299(N-{5-[1-(3,3-dimethylbutanoyl)-1H-indol-2-yl]-2,3-...)
Affinity DataEC50: >3.00E+4nMpH: 7.5 T: 2°C. Assay description: Polyhistidine-tagged human LXR ligand-binding domain was mixed with the test compound, biotin-SRC1 peptide, streptavidin-allophycocyanin, and europiu...
In DepthDetails ArticlePubMed