BDBM273922 US10071079, Example 708::US10478424, Example 708
SMILES CN(C)CC(=O)N1CCC(CC1)c1ccc2[nH]c(c(CC(F)F)c2c1)-c1cc(C)c2nc(C)nn2c1
InChI Key InChIKey=UNPXMUGXQRPUKK-UHFFFAOYSA-N
Data  6 IC50
  Tab Delimited (TSV)   2D SDfile   Computed 3D by Vconf -m prep SDfile
Find this compound or compounds like it in BindingDB:
Activity Spreadsheet -- Enzyme Inhibition Constant Data from BindingDB
Found 6 hits for monomerid = 273922
TargetToll-like receptor 7(Homo sapiens (Human))
Bristol-Myers Squibb
US Patent
LigandPNGBDBM273922(US10071079, Example 708 | US10478424, Example 708)
Affinity DataIC50:  6nMT: 2°C. Assay description: HEK-Blue-cells (Invivogen) overexpressing human TLR7, TLR8 or TLR9 receptors were used for screening inhibitors of these receptors using an inducible...
Ligand InfoPC cidPC sid
In DepthDetails US Patent
TargetToll-like receptor 8(Homo sapiens (Human))
Bristol-Myers Squibb
US Patent
LigandPNGBDBM273922(US10071079, Example 708 | US10478424, Example 708)
Affinity DataIC50:  55.2nMT: 2°C. Assay description: HEK-Blue-cells (Invivogen) overexpressing human TLR7, TLR8 or TLR9 receptors were used for screening inhibitors of these receptors using an inducible...
Ligand InfoPC cidPC sid
In DepthDetails US Patent
TargetToll-like receptor 9(Homo sapiens (Human))
Bristol-Myers Squibb
US Patent
LigandPNGBDBM273922(US10071079, Example 708 | US10478424, Example 708)
Affinity DataIC50:  2.11E+3nM. Assay description: HEK-Blue-cells (Invivogen) overexpressing human TLR7, TLR8 or TLR9 receptors were used for screening inhibitors of these receptors using an inducible...
Ligand InfoPC cidPC sid
In DepthDetails US Patent
TargetToll-like receptor 7(Homo sapiens (Human))
Bristol-Myers Squibb
US Patent
LigandPNGBDBM273922(US10071079, Example 708 | US10478424, Example 708)
Affinity DataIC50:  6nM. Assay description: HEK-Blue-cells (Invivogen) overexpressing human TLR7, TLR8 or TLR9 receptors were used for screening inhibitors of these receptors using an inducible...
Ligand InfoPC cidPC sid
In DepthDetails US Patent
TargetToll-like receptor 8(Homo sapiens (Human))
Bristol-Myers Squibb
US Patent
LigandPNGBDBM273922(US10071079, Example 708 | US10478424, Example 708)
Affinity DataIC50:  55.2nM. Assay description: HEK-Blue-cells (Invivogen) overexpressing human TLR7, TLR8 or TLR9 receptors were used for screening inhibitors of these receptors using an inducible...
Ligand InfoPC cidPC sid
In DepthDetails US Patent
TargetToll-like receptor 9(Homo sapiens (Human))
Bristol-Myers Squibb
US Patent
LigandPNGBDBM273922(US10071079, Example 708 | US10478424, Example 708)
Affinity DataIC50:  2.11E+3nMT: 2°C. Assay description: HEK-Blue-cells (Invivogen) overexpressing human TLR7, TLR8 or TLR9 receptors were used for screening inhibitors of these receptors using an inducible...
Ligand InfoPC cidPC sid
In DepthDetails US Patent