BDBM274685 N-(6-(1-(2-tert-butoxyethyl)-4-(4- fluorophenyl)-1H-imidazol-5-yl) imidazo[1,2-b]pyridazin-2-yl)-2- fluoroisonicotinamide::US9556179, Compound 260
SMILES CC(C)(C)OCCn1cnc(c1-c1ccc2nc(NC(=O)c3ccnc(F)c3)cn2n1)-c1ccc(F)cc1
InChI Key InChIKey=GJNWXEBJYFDCPC-UHFFFAOYSA-N
Data  2 IC50
  Tab Delimited (TSV)   2D SDfile   Computed 3D by Vconf -m prep SDfile
Find this compound or compounds like it in BindingDB:
Activity Spreadsheet -- Enzyme Inhibition Constant Data from BindingDB
Found 2 hits for monomerid = 274685
TargetCasein kinase I isoform delta(Homo sapiens (Human))
Bristol-Myers Squibb
US Patent
LigandPNGBDBM274685(N-(6-(1-(2-tert-butoxyethyl)-4-(4- fluorophenyl)-1...)
Affinity DataIC50:  0.403nMpH: 7.4 T: 2°C. Assay description: The kinase assay was performed in V-bottom 384-well plates. The final assay volume was 30 μl prepared from 15 μl additions of enzyme, subst...
Ligand InfoPC cidPC sid
In DepthDetails US Patent
TargetCasein kinase I isoform epsilon(Homo sapiens (Human))
Bristol-Myers Squibb
US Patent
LigandPNGBDBM274685(N-(6-(1-(2-tert-butoxyethyl)-4-(4- fluorophenyl)-1...)
Affinity DataIC50:  5.53nMpH: 7.4 T: 2°C. Assay description: The kinase assay was performed in V-bottom 384-well plates. The final assay volume was 30 μl prepared from 15 μl additions of enzyme, subst...
Ligand InfoPC cidPC sid
In DepthDetails US Patent