BDBM274751 US9556190, Example 1::US9556190, Example 28
SMILES C[C@@H]1CC[C@H](CN1C(=O)c1ccccc1-n1nccn1)Oc1nccc2c1C(=O)OC2(C)C
InChI Key InChIKey=GUWWYBWZNZHGRM-HZPDHXFCSA-N
Data  2 KI  6 IC50
  Tab Delimited (TSV)   2D SDfile   Computed 3D by Vconf -m prep SDfile
Find this compound or compounds like it in BindingDB:
Activity Spreadsheet -- Enzyme Inhibition Constant Data from BindingDB
Found 8 hits for monomerid = 274751
TargetOrexin receptor type 2(Homo sapiens (Human))
Merck
Curated by ChEMBL
LigandPNGBDBM274751(US9556190, Example 1 | US9556190, Example 28)
Affinity DataKi:  2.20nM. Assay description: Displacement of [3H](S)-N-(2-(1H-pyrrol-1-yl)phenyl)-1-(2-(1-methyl-1H-benzo[d]imidazol-2-ylthio)acetyl)pyrrolidine-2-carboxamide from human OX2R exp...
Ligand InfoPC cidPC sid
In DepthDetails ArticlePubMed
TargetOrexin/Hypocretin receptor type 1(Homo sapiens (Human))
Merck
Curated by ChEMBL
LigandPNGBDBM274751(US9556190, Example 1 | US9556190, Example 28)
Affinity DataKi:  834nM. Assay description: Displacement of [3H](S)-N-(biphenyl-2-yl)-1-(2-(1-methyl-1H-benzo[d]imidazol-2-ylthio)acetyl)pyrrolidine-2-carboxamide from human OX1R expressed in C...
Ligand InfoPC cidPC sid
In DepthDetails ArticlePubMed
TargetOrexin receptor type 2(Homo sapiens (Human))
Merck
Curated by ChEMBL
LigandPNGBDBM274751(US9556190, Example 1 | US9556190, Example 28)
Affinity DataIC50:  16nM. Assay description:  In a typical experiment the OX1 and OX2 receptor antagonistic activity of the compounds of the present invention was determined in accordance with t...
Ligand InfoPC cidPC sid
In DepthDetails US Patent
TargetOrexin receptor type 2(Homo sapiens (Human))
Merck
Curated by ChEMBL
LigandPNGBDBM274751(US9556190, Example 1 | US9556190, Example 28)
Affinity DataIC50:  20nM. Assay description: Antagonist activity at human OX2R expressed in CHOK1 cells assessed as reduction in orexin A-induced calcium flux preincubated followed by orexin A a...
Ligand InfoPC cidPC sid
In DepthDetails ArticlePubMed
TargetOrexin/Hypocretin receptor type 1(Homo sapiens (Human))
Merck
Curated by ChEMBL
LigandPNGBDBM274751(US9556190, Example 1 | US9556190, Example 28)
Affinity DataIC50:  8.29E+3nM. Assay description: Antagonist activity at human OX1R expressed in CHOK1 cells assessed as reduction in orexin A-induced calcium flux preincubated followed by orexin A a...
Ligand InfoPC cidPC sid
In DepthDetails ArticlePubMed
TargetOrexin/Hypocretin receptor type 1(Homo sapiens (Human))
Merck
Curated by ChEMBL
LigandPNGBDBM274751(US9556190, Example 1 | US9556190, Example 28)
Affinity DataIC50:  8.29E+3nM. Assay description:  In a typical experiment the OX1 and OX2 receptor antagonistic activity of the compounds of the present invention was determined in accordance with t...
Ligand InfoPC cidPC sid
In DepthDetails US Patent
TargetOrexin receptor type 2(Homo sapiens (Human))
Merck
Curated by ChEMBL
LigandPNGBDBM274751(US9556190, Example 1 | US9556190, Example 28)
Affinity DataIC50:  20nM. Assay description:  In a typical experiment the OX1 and OX2 receptor antagonistic activity of the compounds of the present invention was determined in accordance with t...
Ligand InfoPC cidPC sid
In DepthDetails US Patent
TargetOrexin/Hypocretin receptor type 1(Homo sapiens (Human))
Merck
Curated by ChEMBL
LigandPNGBDBM274751(US9556190, Example 1 | US9556190, Example 28)
Affinity DataIC50:  4.67E+3nM. Assay description:  In a typical experiment the OX1 and OX2 receptor antagonistic activity of the compounds of the present invention was determined in accordance with t...
Ligand InfoPC cidPC sid
In DepthDetails US Patent