BDBM274882 N-(6-(7-Acetyl-2-(4-fluorophenyl)-5,6,7,8-tetrahydroimidazo[1,2-a]pyrazin-3-yl)imidazo[1,2-b]pyridazin-2-yl)-2-fluoroisonicotinamide::US9556179, Compound 460
SMILES CC(=O)N1CCn2c(C1)nc(c2-c1ccc2nc(NC(=O)c3ccnc(F)c3)cn2n1)-c1ccc(F)cc1
InChI Key InChIKey=KZJKNCMARYSOEM-UHFFFAOYSA-N
Data  2 IC50
  Tab Delimited (TSV)   2D SDfile   Computed 3D by Vconf -m prep SDfile
Find this compound or compounds like it in BindingDB:
Activity Spreadsheet -- Enzyme Inhibition Constant Data from BindingDB
Found 2 hits for monomerid = 274882
TargetCasein kinase I isoform delta(Homo sapiens (Human))
Bristol-Myers Squibb
US Patent
LigandPNGBDBM274882(N-(6-(7-Acetyl-2-(4-fluorophenyl)-5,6,7,8-tetrahyd...)
Affinity DataIC50:  0.600nMpH: 7.4 T: 2°C. Assay description: The kinase assay was performed in V-bottom 384-well plates. The final assay volume was 30 μl prepared from 15 μl additions of enzyme, subst...
Ligand InfoPC cidPC sid
In DepthDetails US Patent
TargetCasein kinase I isoform epsilon(Homo sapiens (Human))
Bristol-Myers Squibb
US Patent
LigandPNGBDBM274882(N-(6-(7-Acetyl-2-(4-fluorophenyl)-5,6,7,8-tetrahyd...)
Affinity DataIC50:  3.70nMpH: 7.4 T: 2°C. Assay description: The kinase assay was performed in V-bottom 384-well plates. The final assay volume was 30 μl prepared from 15 μl additions of enzyme, subst...
Ligand InfoPC cidPC sid
In DepthDetails US Patent