BDBM275066 US10221195, Example 8::US9879032, Example 8
SMILES COc1ccc(CN2CCOc3ncc(NS(=O)(=O)c4cc(Cl)ccc4OC)cc3C2=O)c(CO)c1
InChI Key InChIKey=WTXBDFUIXOEUOR-UHFFFAOYSA-N
Data  2 IC50
  Tab Delimited (TSV)   2D SDfile   Computed 3D by Vconf -m prep SDfile
Find this compound or compounds like it in BindingDB:
Activity Spreadsheet -- Enzyme Inhibition Constant Data from BindingDB
Found 2 hits for monomerid = 275066
TargetAlkaline phosphatase, tissue-nonspecific isozyme(Homo sapiens (Human))
Daiichi Sankyo
US Patent
LigandPNGBDBM275066(US10221195, Example 8 | US9879032, Example 8)
Affinity DataIC50:  9.10nM. Assay description: COS1 cells (DS Pharma Biomedical Co., Ltd.) were transfected with human TNAP (OriGene Technologies, Inc.) using Lipofectamine LTX & Plus reagent (Inv...
Ligand InfoPC cidPC sid
In DepthDetails US Patent
TargetAlkaline phosphatase, tissue-nonspecific isozyme(Homo sapiens (Human))
Daiichi Sankyo
US Patent
LigandPNGBDBM275066(US10221195, Example 8 | US9879032, Example 8)
Affinity DataIC50:  9.10nMT: 2°C. Assay description: COS 1 cells (DS Pharma Biomedical Co., Ltd.) were transfected with human TNAP (OriGene Technologies, Inc.) using Lipofectamine LTX & Plus reagent (In...
Ligand InfoPC cidPC sid
In DepthDetails US Patent