BDBM27544 4-[(3-{[4-(pyridin-2-yl)piperazin-1-yl]carbonyl}phenyl)methyl]-1,2-dihydrophthalazin-1-one::Piperazine analogue, 25
SMILES O=C(N1CCN(CC1)c1ccccn1)c1cccc(Cc2n[nH]c(=O)c3ccccc23)c1
InChI Key InChIKey=KTPOWDHTPBPVFM-UHFFFAOYSA-N
Data  1 IC50
  Tab Delimited (TSV)   2D SDfile   Computed 3D by Vconf -m prep SDfile
Find this compound or compounds like it in BindingDB:
Activity Spreadsheet -- Enzyme Inhibition Constant Data from BindingDB
Found 1 hit for monomerid = 27544
TargetPoly [ADP-ribose] polymerase 1(Homo sapiens (Human))
Kudos Pharmaceuticals
LigandPNGBDBM27544(4-[(3-{[4-(pyridin-2-yl)piperazin-1-yl]carbonyl}ph...)
Affinity DataIC50:  10nMpH: 7.4 T: 2°C. Assay description: A FlashPlate scintillation proximity assay has been developed to identify inhibitors of PARP-1. The mechanism of action of the assay requires the bin...
In DepthDetails ArticlePubMed