BDBM27558 4-({3-[(4-methylpiperazin-1-yl)carbonyl]phenyl}methyl)-1,2-dihydrophthalazin-1-one::Alkylpiperazine analogue, 39
SMILES CN1CCN(CC1)C(=O)c1cccc(Cc2n[nH]c(=O)c3ccccc23)c1
InChI Key InChIKey=IYCYPHAKLKOFJH-UHFFFAOYSA-N
Data  1 IC50
  Tab Delimited (TSV)   2D SDfile   Computed 3D by Vconf -m prep SDfile
Find this compound or compounds like it in BindingDB:
Activity Spreadsheet -- Enzyme Inhibition Constant Data from BindingDB
Found 1 hit for monomerid = 27558
TargetPoly [ADP-ribose] polymerase 1(Homo sapiens (Human))
Kudos Pharmaceuticals
LigandPNGBDBM27558(4-({3-[(4-methylpiperazin-1-yl)carbonyl]phenyl}met...)
Affinity DataIC50:  88nMpH: 7.4 T: 2°C. Assay description: A FlashPlate scintillation proximity assay has been developed to identify inhibitors of PARP-1. The mechanism of action of the assay requires the bin...
In DepthDetails ArticlePubMed