BDBM275733 US10071086, Compound 599
SMILES Fc1ccccc1-c1cccc2[nH]c(nc12)-c1n[nH]c2ncc(cc12)-c1cncc(CN2CCCC2)c1
InChI Key InChIKey=BDSGWUKPDOHVKA-UHFFFAOYSA-N
Data  1 IC50
  Tab Delimited (TSV)   2D SDfile   Computed 3D by Vconf -m prep SDfile
Find this compound or compounds like it in BindingDB:
Activity Spreadsheet -- Enzyme Inhibition Constant Data from BindingDB
Found 1 hit for monomerid = 275733
TargetAdenomatous polyposis coli protein(Homo sapiens (Human))
Samumed
US Patent
LigandPNGBDBM275733(US10071086, Compound 599)
Affinity DataIC50:  220nM. Assay description: Reporter cell lines can be generated by stably transducing cells of cancer cell lines (e.g., colon cancer) with a lentiviral construct that include a...
Ligand InfoPC cidPC sid
In DepthDetails US Patent