BDBM275878 US10071957, Example 97
SMILES COc1ncccc1-c1cc(ccc1Oc1ccc(OC(F)(F)F)c(Cl)c1)C(=O)NS(=O)(=O)N1CCC1
InChI Key InChIKey=RNOCFFDTSOWNRA-UHFFFAOYSA-N
Data  1 IC50
  Tab Delimited (TSV)   2D SDfile   Computed 3D by Vconf -m prep SDfile
Find this compound or compounds like it in BindingDB:
Activity Spreadsheet -- Enzyme Inhibition Constant Data from BindingDB
Found 1 hit for monomerid = 275878
TargetSodium channel protein type 9 subunit alpha(Homo sapiens (Human))
Genentech
US Patent
LigandPNGBDBM275878(US10071957, Example 97)
Affinity DataIC50:  52nMpH: 7.4 T: 2°C. Assay description: Preparation of membranes containing recombinantly expressed sodium channels: Frozen recombinant cell pellets were thawed on ice and diluted to 4 time...
Ligand InfoPC cidPC sid
In DepthDetails US Patent