BDBM276459 5-Bromo-2-[[1-[3-(difluoromethyl)-4-fluoro-phenyl]triazol-4-::US10071988, Example 398::US10233173, Example 398
SMILES FC(F)c1cc(ccc1F)-n1cc(COc2ncc(Br)cn2)nn1
InChI Key InChIKey=GGIDVPDWWXIYLD-UHFFFAOYSA-N
Data  2 IC50
  Tab Delimited (TSV)   2D SDfile   Computed 3D by Vconf -m prep SDfile
Find this compound or compounds like it in BindingDB:
Activity Spreadsheet -- Enzyme Inhibition Constant Data from BindingDB
Found 2 hits for monomerid = 276459
TargetGlutamate receptor ionotropic, NMDA 1/2B(Homo sapiens (Human))
Janssen Pharmaceutica
US Patent
LigandPNGBDBM276459(5-Bromo-2-[[1-[3-(difluoromethyl)-4-fluoro-phenyl]...)
Affinity DataIC50:  3nM. Assay description: NMDA receptors are ion channels that are highly permeable to Ca2+ ions, rendering it possible to monitor NMDA receptor function using cell-based calc...
Ligand InfoPC cidPC sid
In DepthDetails US Patent
TargetRetinoic acid receptor RXR-alpha(Homo sapiens (Human))
Janssen Pharmaceutica
US Patent
LigandPNGBDBM276459(5-Bromo-2-[[1-[3-(difluoromethyl)-4-fluoro-phenyl]...)
Affinity DataIC50:  3nMpH: 7.4 T: 2°C. Assay description: NMDA receptors are ion channels that are highly permeable to Ca2+ ions, rendering it possible to monitor NMDA receptor function using cell-based calc...
Ligand InfoPC cidPC sid
In DepthDetails US Patent