BDBM27687 4,6-dimethyl-2,4,5-triazatricyclo[7.3.0.0^{3,7}]dodeca-1(9),3(7),5-trien-8-one::ring-fused pyrazolo pyridin-2-one, 15
SMILES Cc1nn(C)c2nc3CCCc3c(O)c12
InChI Key InChIKey=KFOFHRKQORYZQW-UHFFFAOYSA-N
Data  1 IC50
  Tab Delimited (TSV)   2D SDfile   Computed 3D by Vconf -m prep SDfile
Find this compound or compounds like it in BindingDB:
Activity Spreadsheet -- Enzyme Inhibition Constant Data from BindingDB
Found 1 hit for monomerid = 27687
TargetPoly [ADP-ribose] polymerase 1(Homo sapiens (Human))
Deltagen Research Laboratories
LigandPNGBDBM27687(4,6-dimethyl-2,4,5-triazatricyclo[7.3.0.0^{3,7}]do...)
Affinity DataIC50:  7.00E+3nMpH: 8.0 T: 2°C. Assay description: To assess the inhibitory activity of novel inhibitors, the PARP-1 enzyme assay was carried out in reaction mixture consisting of Escherichia coli str...
In DepthDetails ArticlePubMed