BDBM27713 1-[4-(4-phenyl-1,2,3,6-tetrahydropyridin-1-yl)butyl]-1,2,3,4-tetrahydroquinazoline-2,4-dione::quinazolidinone analogue, 2a
SMILES O=c1[nH]c(=O)c2ccccc2n1CCCCN1CCC(=CC1)c1ccccc1
InChI Key InChIKey=HWAMZZDVCNUNNL-UHFFFAOYSA-N
Data  2 IC50
  Tab Delimited (TSV)   2D SDfile   Computed 3D by Vconf -m prep SDfile
Find this compound or compounds like it in BindingDB:
Activity Spreadsheet -- Enzyme Inhibition Constant Data from BindingDB
Found 2 hits for monomerid = 27713
TargetPoly [ADP-ribose] polymerase 2(Mus musculus (Mouse))
Fujisawa Pharmaceutical
LigandPNGBDBM27713(1-[4-(4-phenyl-1,2,3,6-tetrahydropyridin-1-yl)buty...)
Affinity DataIC50:  70nMT: 2°C. Assay description: To assess the inhibitory activity of novel inhibitors, the PARP enzyme assay was carried out in reaction mixture consisting of activated salmon teste...
In DepthDetails ArticlePubMed
TargetPoly [ADP-ribose] polymerase 1(Homo sapiens (Human))
Fujisawa Pharmaceutical
LigandPNGBDBM27713(1-[4-(4-phenyl-1,2,3,6-tetrahydropyridin-1-yl)buty...)
Affinity DataIC50:  120nMpH: 8.0 T: 2°C. Assay description: To assess the inhibitory activity of novel inhibitors, the PARP enzyme assay was carried out in reaction mixture consisting of activated salmon teste...
In DepthDetails ArticlePubMed