BDBM277506 US10072026, Example 3-11::US11780852, Example 3-11
SMILES Cc1cc(Nc2cc3ncccc3c(N[C@H]3C[C@@H]4CCC[C@H](C3)N4C(=O)OCC#N)n2)n[nH]1
InChI Key
Data  8 KI
  Tab Delimited (TSV)   2D SDfile   Computed 3D by Vconf -m prep SDfile
Find this compound or compounds like it in BindingDB:
Activity Spreadsheet -- Enzyme Inhibition Constant Data from BindingDB
Found 8 hits for monomerid = 277506
TargetTyrosine-protein kinase JAK1(Homo sapiens (Human))
Theravance Biopharma R&D Ip
US Patent
LigandPNGBDBM277506(US10072026, Example 3-11 | US11780852, Example 3-1...)
Affinity DataKi:  0.550nM. Assay description: Biochemical JAK and Off-Target Kinase Assays. A panel of four LanthaScreen JAK biochemical assays (JAK1, 2, 3 and Tyk2) were carried in a common kin...
Ligand InfoPC cidPC sid
In DepthDetails US Patent
TargetTyrosine-protein kinase JAK2(Homo sapiens (Human))
Theravance Biopharma R&D Ip
US Patent
LigandPNGBDBM277506(US10072026, Example 3-11 | US11780852, Example 3-1...)
Affinity DataKi:  0.550nMpH: 7.5Assay Description:A panel of four LanthaScreen JAK biochemical assays (JAK1, 2, 3 and Tyk2) were carried in a common kinase reaction buffer (50 mM HEPES, pH 7.5, 0.01%...
Ligand InfoPC cidPC sid
In DepthDetails US Patent
TargetTyrosine-protein kinase JAK1(Homo sapiens (Human))
Theravance Biopharma R&D Ip
US Patent
LigandPNGBDBM277506(US10072026, Example 3-11 | US11780852, Example 3-1...)
Affinity DataKi:  0.550nMpH: 7.5Assay Description:A panel of four LanthaScreen JAK biochemical assays (JAK1, 2, 3 and Tyk2) were carried in a common kinase reaction buffer (50 mM HEPES, pH 7.5, 0.01%...
Ligand InfoPC cidPC sid
In DepthDetails US Patent
TargetTyrosine-protein kinase JAK2(Homo sapiens (Human))
Theravance Biopharma R&D Ip
US Patent
LigandPNGBDBM277506(US10072026, Example 3-11 | US11780852, Example 3-1...)
Affinity DataKi:  0.550nM. Assay description: Biochemical JAK and Off-Target Kinase Assays. A panel of four LanthaScreen JAK biochemical assays (JAK1, 2, 3 and Tyk2) were carried in a common kin...
Ligand InfoPC cidPC sid
In DepthDetails US Patent
TargetTyrosine-protein kinase JAK3(Homo sapiens (Human))
Theravance Biopharma R&D Ip
US Patent
LigandPNGBDBM277506(US10072026, Example 3-11 | US11780852, Example 3-1...)
Affinity DataKi:  50nMpH: 7.5Assay Description:A panel of four LanthaScreen JAK biochemical assays (JAK1, 2, 3 and Tyk2) were carried in a common kinase reaction buffer (50 mM HEPES, pH 7.5, 0.01%...
Ligand InfoPC cidPC sid
In DepthDetails US Patent
TargetNon-receptor tyrosine-protein kinase TYK2(Homo sapiens (Human))
Theravance Biopharma R&D Ip
US Patent
LigandPNGBDBM277506(US10072026, Example 3-11 | US11780852, Example 3-1...)
Affinity DataKi:  50nMpH: 7.5Assay Description:A panel of four LanthaScreen JAK biochemical assays (JAK1, 2, 3 and Tyk2) were carried in a common kinase reaction buffer (50 mM HEPES, pH 7.5, 0.01%...
Ligand InfoPC cidPC sid
In DepthDetails US Patent
TargetTyrosine-protein kinase JAK3(Homo sapiens (Human))
Theravance Biopharma R&D Ip
US Patent
LigandPNGBDBM277506(US10072026, Example 3-11 | US11780852, Example 3-1...)
Affinity DataKi:  50.5nM. Assay description: Biochemical JAK and Off-Target Kinase Assays. A panel of four LanthaScreen JAK biochemical assays (JAK1, 2, 3 and Tyk2) were carried in a common kin...
Ligand InfoPC cidPC sid
In DepthDetails US Patent
TargetNon-receptor tyrosine-protein kinase TYK2(Homo sapiens (Human))
Theravance Biopharma R&D Ip
US Patent
LigandPNGBDBM277506(US10072026, Example 3-11 | US11780852, Example 3-1...)
Affinity DataKi:  50.5nM. Assay description: Biochemical JAK and Off-Target Kinase Assays. A panel of four LanthaScreen JAK biochemical assays (JAK1, 2, 3 and Tyk2) were carried in a common kin...
Ligand InfoPC cidPC sid
In DepthDetails US Patent