BDBM277733 3-{[1-(cyclopentylmethyl)-5-fluoro-1H-indazol-3-yl]amino}pyridine-4-carboxylic acid::US10040779, Example 30::US10336727, Example 30::US9617242, Example 30
SMILES OC(=O)c1ccncc1Nc1nn(CC2CCCC2)c2ccc(F)cc12
InChI Key InChIKey=ZIISMGYCXSHSOU-UHFFFAOYSA-N
Data  3 IC50
  Tab Delimited (TSV)   2D SDfile   Computed 3D by Vconf -m prep SDfile
Find this compound or compounds like it in BindingDB:
Activity Spreadsheet -- Enzyme Inhibition Constant Data from BindingDB
Found 3 hits for monomerid = 277733
TargetLysine-specific demethylase 5A(Homo sapiens (Human))
Celgene Quanticel Research
US Patent
LigandPNGBDBM277733(3-{[1-(cyclopentylmethyl)-5-fluoro-1H-indazol-3-yl...)
Affinity DataIC50: <100nM. Assay description: The enzymatic assay of Jarid1A activity is based upon Time Resolved-Fluorescence Resonance Energy Transfer (TR-FRET) detection. The ability of test c...
Ligand InfoPC cidPC sid
In DepthDetails US Patent
TargetLysine-specific demethylase 4C(Homo sapiens (Human))
Celgene Quanticel Research
US Patent
LigandPNGBDBM277733(3-{[1-(cyclopentylmethyl)-5-fluoro-1H-indazol-3-yl...)
Affinity DataIC50:  550nM. Assay description: The ability of test compounds to inhibit the activity of JMJD2C was determined in 384-well plate format under the following reaction conditions: 0.3 ...
Ligand InfoPC cidPC sid
In DepthDetails US Patent
TargetLysine-specific demethylase 5B(Homo sapiens (Human))
Celgene Quanticel Research
US Patent
LigandPNGBDBM277733(3-{[1-(cyclopentylmethyl)-5-fluoro-1H-indazol-3-yl...)
Affinity DataIC50: <100nM. Assay description: The ability of test compounds to inhibit the activity of Jarid1B was determined in 384-well plate format under the following reaction conditions: 0.8...
Ligand InfoPC cidPC sid
In DepthDetails US Patent