BDBM278270 2-(((3R,4S)-3-fluoro-1-(2-methoxyacetyl)piperidin-4-yl)oxy)-5-(4-((4-(1-formylpiperidin-4-yl)-3-methylphenyl)amino)-1,3,5-triazin-2-yl)benzonitrile::US10040781, Example 492::US10253019, Example 492
SMILES COCC(=O)N1CC[C@H](Oc2ccc(cc2C#N)-c2ncnc(Nc3ccc(C4CCN(CC4)C=O)c(C)c3)n2)[C@H](F)C1
InChI Key InChIKey=ZTDINRKSUABPHP-IAPPQJPRSA-N
Data  6 IC50
  Tab Delimited (TSV)   2D SDfile   Computed 3D by Vconf -m prep SDfile
Find this compound or compounds like it in BindingDB:
Activity Spreadsheet -- Enzyme Inhibition Constant Data from BindingDB
Found 6 hits for monomerid = 278270
TargetSerine/threonine-protein kinase TBK1(Homo sapiens (Human))
Gilead Sciences
US Patent
LigandPNGBDBM278270(2-(((3R,4S)-3-fluoro-1-(2-methoxyacetyl)piperidin-...)
Affinity DataIC50:  2.00E+3nMpH: 7.0Assay Description:Enzymatic activity of IKKε and TBK1 was measured using a homogeneous time resolved fluorescence resonance energy transfer (TR-FRET) assay that m...
Ligand InfoPC cidPC sid
In DepthDetails US Patent
TargetInhibitor of nuclear factor kappa-B kinase subunit epsilon(Homo sapiens (Human))
Gilead Sciences
US Patent
LigandPNGBDBM278270(2-(((3R,4S)-3-fluoro-1-(2-methoxyacetyl)piperidin-...)
Affinity DataIC50:  1.00E+3nMpH: 7.0Assay Description:Enzymatic activity of IKKε and TBK1 was measured using a homogeneous time resolved fluorescence resonance energy transfer (TR-FRET) assay that m...
Ligand InfoPC cidPC sid
In DepthDetails US Patent
TargetTyrosine-protein kinase JAK2(Homo sapiens (Human))
Gilead Sciences
US Patent
LigandPNGBDBM278270(2-(((3R,4S)-3-fluoro-1-(2-methoxyacetyl)piperidin-...)
Affinity DataIC50:  482nM. Assay description: Enzymatic activity of hJAK2 was measured using a LANCE homogeneous time resolved fluorescence resonance energy transfer (TR-FRET) assay that monitors...
Ligand InfoPC cidPC sid
In DepthDetails US Patent
TargetSerine/threonine-protein kinase TBK1(Homo sapiens (Human))
Gilead Sciences
US Patent
LigandPNGBDBM278270(2-(((3R,4S)-3-fluoro-1-(2-methoxyacetyl)piperidin-...)
Affinity DataIC50:  2nM. Assay description: Enzymatic activity of IKKε and TBK1 was measured using a homogeneous time resolved fluorescence resonance energy transfer (TR-FRET) assay that m...
Ligand InfoPC cidPC sid
In DepthDetails US Patent
TargetInhibitor of nuclear factor kappa-B kinase subunit epsilon(Homo sapiens (Human))
Gilead Sciences
US Patent
LigandPNGBDBM278270(2-(((3R,4S)-3-fluoro-1-(2-methoxyacetyl)piperidin-...)
Affinity DataIC50:  1nM. Assay description: Enzymatic activity of IKKε and TBK1 was measured using a homogeneous time resolved fluorescence resonance energy transfer (TR-FRET) assay that m...
Ligand InfoPC cidPC sid
In DepthDetails US Patent
TargetTyrosine-protein kinase JAK2(Homo sapiens (Human))
Gilead Sciences
US Patent
LigandPNGBDBM278270(2-(((3R,4S)-3-fluoro-1-(2-methoxyacetyl)piperidin-...)
Affinity DataIC50:  4.82E+5nMpH: 7.5Assay Description:Enzymatic activity of hJAK2 was measured using a LANCE homogeneous time resolved fluorescence resonance energy transfer (TR-FRET) assay that monitors...
Ligand InfoPC cidPC sid
In DepthDetails US Patent