BDBM2785 Alkenyldiarylmethane (ADAM) 27a::Alkenyldiarylmethanes (ADAM) 27a::Isopropyl 3,3-Dibromo-4,4-dimethoxy-5,5-bis(methoxycarbonyl)-6,6-diphenyl-5-hexenoate::methyl 3-bromo-5-{1-[3-bromo-4-methoxy-5-(methoxycarbonyl)phenyl]-6-oxo-6-(propan-2-yloxy)hex-1-en-1-yl}-2-methoxybenzoate
SMILES [#6]-[#8]-[#6](=O)-c1cc(cc(Br)c1-[#8]-[#6])-[#6](=[#6]/[#6]-[#6]-[#6]-[#6](=O)-[#8]-[#6](-[#6])-[#6])\c1cc(Br)c(-[#8]-[#6])c(c1)-[#6](=O)-[#8]-[#6]
InChI Key InChIKey=RZBIETXDVPBASJ-UHFFFAOYSA-N
Data  1 IC50
  Tab Delimited (TSV)   2D SDfile   Computed 3D by Vconf -m prep SDfile
Find this compound or compounds like it in BindingDB:
Activity Spreadsheet -- Enzyme Inhibition Constant Data from BindingDB
Found 1 hit for monomerid = 2785
TargetGag-Pol polyprotein [588-1027]/[588-1147](Human immunodeficiency virus type 1)
Purdue University
LigandPNGBDBM2785(Alkenyldiarylmethane (ADAM) 27a | Alkenyldiarylmet...)
Affinity DataIC50:  7.08E+4nM. Assay description: The IC50 of reverse transcriptase is the concentration that inhibits 50% of recombinant HIV-1 RT RNA-directed DNA polymerase activity in vitro.
In DepthDetails ArticlePubMed