BDBM27853 3-hydroxy-N-[(2-methoxyphenyl)methyl]-4-oxo-4H-pyran-2-carboxamide::hydroxypyrone amide, 5a
SMILES COc1ccccc1CNC(=O)c1occc(=O)c1O
InChI Key InChIKey=UNPWWFFAXNDLIO-UHFFFAOYSA-N
Data  1 IC50
  Tab Delimited (TSV)   2D SDfile   Computed 3D by Vconf -m prep SDfile
Find this compound or compounds like it in BindingDB:
Activity Spreadsheet -- Enzyme Inhibition Constant Data from BindingDB
Found 1 hit for monomerid = 27853
TargetLethal factor(Bacillus anthracis)
Howard Hughes Medical Institute
LigandPNGBDBM27853(3-hydroxy-N-[(2-methoxyphenyl)methyl]-4-oxo-4H-pyr...)
Affinity DataIC50: >1.00E+5nMpH: 7.0 T: 2°C. Assay description: Fluorescence peptide cleavage assay was performed in a 96-well plate. Each reaction contained fluorogenic peptide substrate, LF, and small-molecule i...
In DepthDetails ArticlePubMed