BDBM27854 3-hydroxy-N-[(3-methoxyphenyl)methyl]-4-oxo-4H-pyran-2-carboxamide::hydroxypyrone amide, 6a
SMILES COc1cccc(CNC(=O)c2occc(=O)c2O)c1
InChI Key InChIKey=LKBSUKPBSZDBQA-UHFFFAOYSA-N
Data  1 IC50
  Tab Delimited (TSV)   2D SDfile   Computed 3D by Vconf -m prep SDfile
Find this compound or compounds like it in BindingDB:
Activity Spreadsheet -- Enzyme Inhibition Constant Data from BindingDB
Found 1 hit for monomerid = 27854
TargetLethal factor(Bacillus anthracis)
Howard Hughes Medical Institute
LigandPNGBDBM27854(3-hydroxy-N-[(3-methoxyphenyl)methyl]-4-oxo-4H-pyr...)
Affinity DataIC50: >1.00E+5nMpH: 7.0 T: 2°C. Assay description: Fluorescence peptide cleavage assay was performed in a 96-well plate. Each reaction contained fluorogenic peptide substrate, LF, and small-molecule i...
In DepthDetails ArticlePubMed