BDBM278585 (2E)-3-(1-{[3-(2,4-Dichloro-6- fluorophenyl)-5-(2- fluoropropan-2-yl)-1,2-oxazol- 4-yl]carbonyl}-3-methyl-1H- indol-4-yl)prop-2-enoic acid ::US10040791, Example 47
SMILES Cc1cn(C(=O)c2c(noc2C(C)(C)F)-c2c(F)cc(Cl)cc2Cl)c2cccc(\C=C\C(O)=O)c12
InChI Key InChIKey=BVUMRBVNGXVXSA-BQYQJAHWSA-N
Data  2 IC50
  Tab Delimited (TSV)   2D SDfile   Computed 3D by Vconf -m prep SDfile
Find this compound or compounds like it in BindingDB:
Activity Spreadsheet -- Enzyme Inhibition Constant Data from BindingDB
Found 2 hits for monomerid = 278585
TargetIsocitrate dehydrogenase [NADP] cytoplasmic [R132C](Homo sapiens (Human))
Daiichi Sankyo
US Patent
LigandPNGBDBM278585((2E)-3-(1-{[3-(2,4-Dichloro-6- fluorophenyl)-5-(2-...)
Affinity DataIC50:  98nMpH: 7.5 T: 2°C. Assay description: The IDH1R132H protein and the IDH1R132C protein were prepared as follows: the IDH1R132H or IDH1R132C gene was integrated into a pET24b(+) vector (Nov...
Ligand InfoPC cidPC sid
In DepthDetails US Patent
TargetIsocitrate dehydrogenase [NADP] cytoplasmic [R132H](Homo sapiens (Human))
Daiichi Sankyo
US Patent
LigandPNGBDBM278585((2E)-3-(1-{[3-(2,4-Dichloro-6- fluorophenyl)-5-(2-...)
Affinity DataIC50:  13nMpH: 7.5 T: 2°C. Assay description: The IDH1R132H protein and the IDH1R132C protein were prepared as follows: the IDH1R132H or IDH1R132C gene was integrated into a pET24b(+) vector (Nov...
Ligand InfoPC cidPC sid
In DepthDetails US Patent