BDBM278586 (2E)-3-(1-{[5-(tert-Butyl)-3- (2,4,6-trichlorophenyl)-1,2- oxazole-4-carbonyl]-7- fluoroindol-4-yl]prop-2-enoic acid ::US10040791, Example 48
SMILES CC(C)(F)c1onc(c1C(=O)n1ccc2c(\C=C\C(O)=O)ccc(F)c12)-c1c(Cl)cc(Cl)cc1Cl
InChI Key InChIKey=MWWIJOCRHKKPLJ-GQCTYLIASA-N
Data  2 IC50
  Tab Delimited (TSV)   2D SDfile   Computed 3D by Vconf -m prep SDfile
Find this compound or compounds like it in BindingDB:
Activity Spreadsheet -- Enzyme Inhibition Constant Data from BindingDB
Found 2 hits for monomerid = 278586
TargetIsocitrate dehydrogenase [NADP] cytoplasmic [R132C](Homo sapiens (Human))
Daiichi Sankyo
US Patent
LigandPNGBDBM278586((2E)-3-(1-{[5-(tert-Butyl)-3- (2,4,6-trichlorophen...)
Affinity DataIC50:  193nMpH: 7.5 T: 2°C. Assay description: The IDH1R132H protein and the IDH1R132C protein were prepared as follows: the IDH1R132H or IDH1R132C gene was integrated into a pET24b(+) vector (Nov...
Ligand InfoPC cidPC sid
In DepthDetails US Patent
TargetIsocitrate dehydrogenase [NADP] cytoplasmic [R132H](Homo sapiens (Human))
Daiichi Sankyo
US Patent
LigandPNGBDBM278586((2E)-3-(1-{[5-(tert-Butyl)-3- (2,4,6-trichlorophen...)
Affinity DataIC50:  29nMpH: 7.5 T: 2°C. Assay description: The IDH1R132H protein and the IDH1R132C protein were prepared as follows: the IDH1R132H or IDH1R132C gene was integrated into a pET24b(+) vector (Nov...
Ligand InfoPC cidPC sid
In DepthDetails US Patent