BDBM27872 N-(diphenylmethyl)-3-hydroxy-4-sulfanylidene-4H-pyran-2-carbothioamide::hydroxypyrothione thioamide, 4c
SMILES Oc1c(occc1=S)C(=S)NC(c1ccccc1)c1ccccc1
InChI Key InChIKey=BRUKVOMOARSEIW-UHFFFAOYSA-N
Data  1 IC50
  Tab Delimited (TSV)   2D SDfile   Computed 3D by Vconf -m prep SDfile
Find this compound or compounds like it in BindingDB:
Activity Spreadsheet -- Enzyme Inhibition Constant Data from BindingDB
Found 1 hit for monomerid = 27872
TargetLethal factor(Bacillus anthracis)
Howard Hughes Medical Institute
LigandPNGBDBM27872(N-(diphenylmethyl)-3-hydroxy-4-sulfanylidene-4H-py...)
Affinity DataIC50:  5.00E+3nMpH: 7.0 T: 2°C. Assay description: Fluorescence peptide cleavage assay was performed in a 96-well plate. Each reaction contained fluorogenic peptide substrate, LF, and small-molecule i...
In DepthDetails ArticlePubMed