BDBM278937 4-{8-amino-3- [(6R,8aS)-6-methyl-3- oxohexahydro[1,3] oxazolo[3,4-a] pyridin-6-yl] imidazo[1,5- alpyrazin-1-yl}-3- ethoxy-N-[4- (trifluoromethyl) pyridin-2-yl] benzamide::US10040805, Example 7
SMILES CCOc1cc(ccc1-c1nc(n2ccnc(N)c12)[C@]1(C)CC[C@H]2COC(=O)N2C1)C(=O)Nc1cc(ccn1)C(F)(F)F
InChI Key InChIKey=HZBFBSZOVNDXHC-XDBZFTIUSA-N
Data  1 IC50
  Tab Delimited (TSV)   2D SDfile   Computed 3D by Vconf -m prep SDfile
Find this compound or compounds like it in BindingDB:
Activity Spreadsheet -- Enzyme Inhibition Constant Data from BindingDB
Found 1 hit for monomerid = 278937
TargetTyrosine-protein kinase BTK(Homo sapiens (Human))
Merck Sharp & Dohme
US Patent
LigandPNGBDBM278937(4-{8-amino-3- [(6R,8aS)-6-methyl-3- oxohexahydro[1...)
Affinity DataIC50:  0.590nM. Assay description: BTK enzymatic activity was determined with the LANCE (Lanthanide Chelate Excite) TR-FRET (Time-resolved fluorescence resonance energy transfer) assay...
Ligand InfoPC cidPC sid
In DepthDetails US Patent