BDBM279011 N-benzyl-5-(2-ethoxy-3-pyridyl)-1-isopropyl-pyrazolo[4,3-b]pyridin-7-amine::US10034861, Example 41::US10512632, Example 41::US10618913, Example S41::US10766893, Example S41::US10806718, Example 41::US11026923, Example 41::US11634416, Example 41
SMILES CCOc1ncccc1-c1cc(NCc2ccccc2)c2n(ncc2n1)C(C)C
InChI Key InChIKey=CAHURFTWFHHOPU-UHFFFAOYSA-N
Data  21 IC50
  Tab Delimited (TSV)   2D SDfile   Computed 3D by Vconf -m prep SDfile
Find this compound or compounds like it in BindingDB:
Activity Spreadsheet -- Enzyme Inhibition Constant Data from BindingDB
Found 21 hits for monomerid = 279011
LigandPNGBDBM279011(N-benzyl-5-(2-ethoxy-3-pyridyl)-1-isopropyl-pyrazo...)
Affinity DataIC50:  500nMpH: 7.6 T: 2°C. Assay description: PDE1A, PDE1B and PDE1C assays were performed as follows: the assays was performed in 60 μL samples containing a fixed amount of the PDE1 enzyme ...
Ligand InfoPC cidPC sid
In DepthDetails US Patent
LigandPNGBDBM279011(N-benzyl-5-(2-ethoxy-3-pyridyl)-1-isopropyl-pyrazo...)
Affinity DataIC50:  500nM. Assay description: PDE1A, PDE1B and PDE1C assays were performed as follows: the assays was performed in 60 μL samples containing a fixed amount of the PDE1 enzyme ...
Ligand InfoPC cidPC sid
In DepthDetails US Patent
LigandPNGBDBM279011(N-benzyl-5-(2-ethoxy-3-pyridyl)-1-isopropyl-pyrazo...)
Affinity DataIC50:  500nMpH: 7.6 T: 2°C. Assay description: PDE1A, PDE1B and PDE1C assays were performed as follows: the assays was performed in 60 μL samples containing a fixed amount of the PDE1 enzyme ...
Ligand InfoPC cidPC sid
In DepthDetails US Patent
LigandPNGBDBM279011(N-benzyl-5-(2-ethoxy-3-pyridyl)-1-isopropyl-pyrazo...)
Affinity DataIC50:  500nM. Assay description: PDE1A, PDE1B and PDE1C assays were performed as follows: the assays was performed in 60 μL samples containing a fixed amount of the PDE1 enzyme ...
Ligand InfoPC cidPC sid
In DepthDetails US Patent
LigandPNGBDBM279011(N-benzyl-5-(2-ethoxy-3-pyridyl)-1-isopropyl-pyrazo...)
Affinity DataIC50:  45nM. Assay description: PDE1A, PDE1B and PDE1C assays were performed as follows: the assays was performed in 60 μL samples containing a fixed amount of the PDE1 enzyme ...
Ligand InfoPC cidPC sid
In DepthDetails US Patent
LigandPNGBDBM279011(N-benzyl-5-(2-ethoxy-3-pyridyl)-1-isopropyl-pyrazo...)
Affinity DataIC50:  500nM. Assay description: PDE1A, PDE1B and PDE1C assays were performed as follows: the assays was performed in 60 μL samples containing a fixed amount of the PDE1 enzyme ...
Ligand InfoPC cidPC sid
In DepthDetails US Patent
LigandPNGBDBM279011(N-benzyl-5-(2-ethoxy-3-pyridyl)-1-isopropyl-pyrazo...)
Affinity DataIC50:  500nM. Assay description: PDE1A, PDE1B and PDE1C assays were performed as follows: the assays were performed in 60 μL samples containing a fixed amount of the PDE1 enzyme...
Ligand InfoPC cidPC sid
In DepthDetails US Patent
LigandPNGBDBM279011(N-benzyl-5-(2-ethoxy-3-pyridyl)-1-isopropyl-pyrazo...)
Affinity DataIC50:  45nM. Assay description: PDE1A, PDE1B and PDE1C assays were performed as follows: the assays were performed in 60 μL samples containing a fixed amount of the PDE1 enzyme...
Ligand InfoPC cidPC sid
In DepthDetails US Patent
LigandPNGBDBM279011(N-benzyl-5-(2-ethoxy-3-pyridyl)-1-isopropyl-pyrazo...)
Affinity DataIC50:  500nM. Assay description: PDE1A, PDE1B and PDE1C assays were performed as follows: the assays were performed in 60 μL samples containing a fixed amount of the PDE1 enzyme...
Ligand InfoPC cidPC sid
In DepthDetails US Patent
LigandPNGBDBM279011(N-benzyl-5-(2-ethoxy-3-pyridyl)-1-isopropyl-pyrazo...)
Affinity DataIC50:  500nM. Assay description: PDE1A, PDE1B and PDE1C assays were performed as follows: the assays were performed in 60 μL samples containing a fixed amount of the PDE1 enzyme...
Ligand InfoPC cidPC sid
In DepthDetails US Patent
LigandPNGBDBM279011(N-benzyl-5-(2-ethoxy-3-pyridyl)-1-isopropyl-pyrazo...)
Affinity DataIC50:  45nM. Assay description: PDE1A, PDE1B and PDE1C assays were performed as follows: the assays were performed in 60 μL samples containing a fixed amount of the PDE1 enzyme...
Ligand InfoPC cidPC sid
In DepthDetails US Patent
LigandPNGBDBM279011(N-benzyl-5-(2-ethoxy-3-pyridyl)-1-isopropyl-pyrazo...)
Affinity DataIC50:  500nM. Assay description: PDE1A, PDE1B and PDE1C assays were performed as follows: the assays were performed in 60 μL samples containing a fixed amount of the PDE1 enzyme...
Ligand InfoPC cidPC sid
In DepthDetails US Patent
LigandPNGBDBM279011(N-benzyl-5-(2-ethoxy-3-pyridyl)-1-isopropyl-pyrazo...)
Affinity DataIC50:  500nM. Assay description: PDE1A, PDE1B and PDE1C assays were performed as follows: the assays was performed in 60 μL samples containing a fixed amount of the PDE1 enzyme ...
Ligand InfoPC cidPC sid
In DepthDetails US Patent
LigandPNGBDBM279011(N-benzyl-5-(2-ethoxy-3-pyridyl)-1-isopropyl-pyrazo...)
Affinity DataIC50:  45nM. Assay description: PDE1A, PDE1B and PDE1C assays were performed as follows: the assays was performed in 60 μL samples containing a fixed amount of the PDE1 enzyme ...
Ligand InfoPC cidPC sid
In DepthDetails US Patent
LigandPNGBDBM279011(N-benzyl-5-(2-ethoxy-3-pyridyl)-1-isopropyl-pyrazo...)
Affinity DataIC50:  500nM. Assay description: PDE1A, PDE1B and PDE1C assays were performed as follows: the assays was performed in 60 μL samples containing a fixed amount of the PDE1 enzyme ...
Ligand InfoPC cidPC sid
In DepthDetails US Patent
LigandPNGBDBM279011(N-benzyl-5-(2-ethoxy-3-pyridyl)-1-isopropyl-pyrazo...)
Affinity DataIC50:  500nM. Assay description: PDE1A, PDE1B and PDE1C assays were performed as follows: the assays was performed in 60 uL samples containing a fixed amount of the PDE1 enzyme (suff...
Ligand InfoPC cidPC sid
In DepthDetails US Patent
LigandPNGBDBM279011(N-benzyl-5-(2-ethoxy-3-pyridyl)-1-isopropyl-pyrazo...)
Affinity DataIC50:  45nM. Assay description: PDE1A, PDE1B and PDE1C assays were performed as follows: the assays was performed in 60 uL samples containing a fixed amount of the PDE1 enzyme (suff...
Ligand InfoPC cidPC sid
In DepthDetails US Patent
LigandPNGBDBM279011(N-benzyl-5-(2-ethoxy-3-pyridyl)-1-isopropyl-pyrazo...)
Affinity DataIC50:  500nM. Assay description: PDE1A, PDE1B and PDE1C assays were performed as follows: the assays was performed in 60 uL samples containing a fixed amount of the PDE1 enzyme (suff...
Ligand InfoPC cidPC sid
In DepthDetails US Patent
LigandPNGBDBM279011(N-benzyl-5-(2-ethoxy-3-pyridyl)-1-isopropyl-pyrazo...)
Affinity DataIC50:  500nM. Assay description: PDE1A, PDE1B and PDE1C assays were performed as follows: the assays was performed in 60 μL samples containing a fixed amount of the PDE1 enzyme ...
Ligand InfoPC cidPC sid
In DepthDetails US Patent
LigandPNGBDBM279011(N-benzyl-5-(2-ethoxy-3-pyridyl)-1-isopropyl-pyrazo...)
Affinity DataIC50:  45nM. Assay description: PDE1A, PDE1B and PDE1C assays were performed as follows: the assays was performed in 60 μL samples containing a fixed amount of the PDE1 enzyme ...
Ligand InfoPC cidPC sid
In DepthDetails US Patent
LigandPNGBDBM279011(N-benzyl-5-(2-ethoxy-3-pyridyl)-1-isopropyl-pyrazo...)
Affinity DataIC50:  45nMpH: 7.6 T: 2°C. Assay description: PDE1A, PDE1B and PDE1C assays were performed as follows: the assays was performed in 60 μL samples containing a fixed amount of the PDE1 enzyme ...
Ligand InfoPC cidPC sid
In DepthDetails US Patent