BDBM279433 US10035760, Example CA-111
SMILES CN(C(=O)[C@H](Cc1cc(F)cc(F)c1)NC(=O)NS(=O)(=O)c1ccccc1C)c1cccc(Cl)c1
InChI Key InChIKey=RAAVMMDRKBYZJR-NRFANRHFSA-N
Data  1 EC50
  Tab Delimited (TSV)   2D SDfile   Computed 3D by Vconf -m prep SDfile
Find this compound or compounds like it in BindingDB:
Activity Spreadsheet -- Enzyme Inhibition Constant Data from BindingDB
Found 1 hit for monomerid = 279433
TargetEnvelope glycoprotein gp160(Human immunodeficiency virus type 1 (isolate BRU/L...)
Viiv Healthcare UK (NO.5)
US Patent
LigandPNGBDBM279433(US10035760, Example CA-111)
Affinity DataEC50:  5.50E+3nM. Assay description: HIV cell culture assay¿MT-2 cells, 293T cells and the proviral DNA clone of NL4-3 virus were obtained from the NIH AIDS Research and Reference Reagen...
Ligand InfoPC cidPC sid
In DepthDetails US Patent