BDBM279505 2-(tert-butoxymethyl)-6-(pyridin-4-yl)-1H-benzo[d]imidazole::US10035777, Example 55
SMILES CC(C)(C)OCC(=O)Nc1ccc(cc1N)-c1ccncc1
InChI Key InChIKey=CRQYQUHQHLUYQJ-UHFFFAOYSA-N
Data  1 IC50
  Tab Delimited (TSV)   2D SDfile   Computed 3D by Vconf -m prep SDfile
Find this compound or compounds like it in BindingDB:
Activity Spreadsheet -- Enzyme Inhibition Constant Data from BindingDB
Found 1 hit for monomerid = 279505
TargetAP2-associated protein kinase 1(Homo sapiens (Human))
Bristol-Myers Squibb
US Patent
LigandPNGBDBM279505(2-(tert-butoxymethyl)-6-(pyridin-4-yl)-1H-benzo[d]...)
Affinity DataIC50:  1.79E+3nMpH: 7.4 T: 2°C. Assay description: The assays were performed in U-bottom 384-well plates. The final assay volume was 30 μl prepared from 15 μl additions of enzyme and substra...
Ligand InfoPC cidPC sid
In DepthDetails US Patent