BDBM279585 US10035780, Compound A
SMILES CN(C)C(=O)Oc1nc(nc2ccccc12)-c1ccccc1
InChI Key InChIKey=NAXSAPGEPBKPDD-UHFFFAOYSA-N
Data  1 KI
  Tab Delimited (TSV)   2D SDfile   Computed 3D by Vconf -m prep SDfile
Find this compound or compounds like it in BindingDB:
Activity Spreadsheet -- Enzyme Inhibition Constant Data from BindingDB
Found 1 hit for monomerid = 279585
TargetTranslocator protein(Homo sapiens (Human))
Technion Research & Development Foundation
US Patent
LigandPNGBDBM279585(US10035780, Compound A)
Affinity DataKi:  600nM. Assay description: For the assays described herein systemic injections of kainic in rats were applied and also contusion (Veenman et al. 2002; Soustiel et al. Neuropath...
Ligand InfoPC cidPC sid
In DepthDetails US Patent