BDBM280838 (5S)-3-{2-[4-amino-5- methyl-6-oxo-2-{1- [tetrahydro-2H-pyran-2- ylmethyl]-1H- pyrazolo[3,4-b]pyridin-3- yl}-6,7-dihydro-5H- pyrrolo[2,3-d]pyrimidin- 5-yl]-1,3-thiazol-4-yl}- 2,2-dimethylpropanoic acid::US10030027, Example 123AA::US10030027, Example 123AB::US10428076, Example 123AB
SMILES CC(C)(Cc1csc(n1)[C@]1(C)C(=O)Nc2nc(nc(N)c12)-c1nn(CC2CCCCO2)c2ncccc12)C(O)=O
InChI Key InChIKey=JQJPUKICTQBAPJ-KSKVVAMCSA-N
Data  4 KI
  Tab Delimited (TSV)   2D SDfile   Computed 3D by Vconf -m prep SDfile
Find this compound or compounds like it in BindingDB:
Activity Spreadsheet -- Enzyme Inhibition Constant Data from BindingDB
Found 4 hits for monomerid = 280838
TargetGuanylate cyclase soluble subunit alpha-1(Homo sapiens (Human))
Merck Sharp & Dohme
US Patent
LigandPNGBDBM280838((5S)-3-{2-[4-amino-5- methyl-6-oxo-2-{1- [tetrahyd...)
Affinity DataKi:  0.874nMpH: 7.4Assay Description:The binding potencies of sGC compounds to the human recombinant sGC enzyme were determined in a Size Exclusion Chromatography (SEC) competition bindi...
Ligand InfoPC cidPC sid
In DepthDetails US Patent
TargetGuanylate cyclase soluble subunit alpha-1/beta-1(Homo sapiens (Human))
Merck Sharp & Dohme
US Patent
LigandPNGBDBM280838((5S)-3-{2-[4-amino-5- methyl-6-oxo-2-{1- [tetrahyd...)
Affinity DataKi:  0.874nM. Assay description: The binding buffer was composed of 50 mM triethanolamine, pH 7.4, 3 mM MgCl2, 0.025% BSA, 2 mM dithiothreitol (DTT), 300 μM DETA/NO and 400 _...
Ligand InfoPC cidPC sid
In DepthDetails US Patent
TargetGuanylate cyclase soluble subunit alpha-1/beta-1(Homo sapiens (Human))
Merck Sharp & Dohme
US Patent
LigandPNGBDBM280838((5S)-3-{2-[4-amino-5- methyl-6-oxo-2-{1- [tetrahyd...)
Affinity DataKi:  1.23nM. Assay description: The binding buffer was composed of 50 mM triethanolamine, pH 7.4, 3 mM MgCl2, 0.025% BSA, 2 mM dithiothreitol (DTT), 300 μM DETA/NO and 400 _...
Ligand InfoPC cidPC sid
In DepthDetails US Patent
TargetGuanylate cyclase soluble subunit alpha-1(Homo sapiens (Human))
Merck Sharp & Dohme
US Patent
LigandPNGBDBM280838((5S)-3-{2-[4-amino-5- methyl-6-oxo-2-{1- [tetrahyd...)
Affinity DataKi:  1.23nMpH: 7.4Assay Description:The binding potencies of sGC compounds to the human recombinant sGC enzyme were determined in a Size Exclusion Chromatography (SEC) competition bindi...
Ligand InfoPC cidPC sid
In DepthDetails US Patent