BDBM281 75412_FLUKA::MLS001332465::MLS001332466::SMR000857105::Sennoside B::cid_16218503
SMILES [H][C@@]1(c2cccc(OC3O[C@H](CO)[C@@H](O)[C@H](O)[C@H]3O)c2C(=O)c2c(O)cc(cc12)C(O)=O)[C@]1([H])c2cccc(O[C@@H]3O[C@H](CO)[C@@H](O)[C@H](O)[C@H]3O)c2C(=O)c2c(O)cc(cc12)C(O)=O
InChI Key InChIKey=IPQVTOJGNYVQEO-OVYIKYHGSA-N
Data  3 IC50
  Tab Delimited (TSV)   2D SDfile   Computed 3D by Vconf -m prep SDfile
Find this compound or compounds like it in BindingDB:
Activity Spreadsheet -- Enzyme Inhibition Constant Data from BindingDB
Found 3 hits for monomerid = 281
TargetHexokinase HKDC1 [W721R](Homo sapiens (Human))
Burnham Center For Chemical Genomics
Curated by PubChem BioAssay
LigandPNGBDBM281(75412_FLUKA | MLS001332465 | MLS001332466 | SMR000...)
Affinity DataIC50:  4.09E+3nM. Assay description: Data Source: Sanford-Burnham Center for Chemical Genomics (SBCCG) Source Affiliation: Sanford-Burnham Medical Research Institute (SBMRI, San Diego, C...
In DepthDetails PCBioAssay
TargetHexokinase HKDC1 [W721R](Homo sapiens (Human))
Burnham Center For Chemical Genomics
Curated by PubChem BioAssay
LigandPNGBDBM281(75412_FLUKA | MLS001332465 | MLS001332466 | SMR000...)
Affinity DataIC50:  8.00E+4nM. Assay description: Data Source: Sanford-Burnham Center for Chemical Genomics (SBCCG) Source Affiliation: Sanford-Burnham Medical Research Institute (SBMRI, San Diego, C...
In DepthDetails PCBioAssay
TargetTropomyosin alpha-1 chain(Sus scrofa)
The Scripps Research Institute Molecular Screening Center
Curated by PubChem BioAssay
LigandPNGBDBM281(75412_FLUKA | MLS001332465 | MLS001332466 | SMR000...)
Affinity DataIC50:  1.82E+3nM. Assay description: Source (MLPCN Center Name): The Scripps Research Institute Molecular Screening Center (SRIMSC) Affiliation: The Scripps Research Institute, TSRI Assa...
In DepthDetails PCBioAssay