BDBM281184 US10022354, Example 124
SMILES CCCC(=O)NC1CCN(C1)C(=O)c1cc(n[nH]1)C(C)C
InChI Key InChIKey=OLFMDZINSHQFQJ-UHFFFAOYSA-N
Data  1 IC50
  Tab Delimited (TSV)   2D SDfile   Computed 3D by Vconf -m prep SDfile
Find this compound or compounds like it in BindingDB:
Activity Spreadsheet -- Enzyme Inhibition Constant Data from BindingDB
Found 1 hit for monomerid = 281184
TargetLysine-specific demethylase 5A(Homo sapiens (Human))
Genentech
US Patent
LigandPNGBDBM281184(US10022354, Example 124)
Affinity DataIC50:  0.150nMpH: 7.0 T: 2°C. Assay description: Full length KDM5A enzyme was expressed and purified inhouse. Biotin-H3K4me3 peptide was purchased from New England Biolabs. HTRF reagents (containing...
Ligand InfoPC cidPC sid
In DepthDetails US Patent