BDBM281338 N-[2-({[6-(2-ethyl-5-fluoro-4-hydroxyphenyl)-1H-pyrazolo[4,3-c]pyridin-4-yl](propyl)amino}methyl)-4-methylphenyl]-N-::US10022376, Example 144
SMILES CCCN(Cc1cc(C)ccc1N(C)S(C)(=O)=O)c1nc(cc2[nH]ncc12)-c1cc(F)c(O)cc1CC
InChI Key InChIKey=BMZPTDVPNTYCJK-UHFFFAOYSA-N
Data  8 IC50
  Tab Delimited (TSV)   2D SDfile   Computed 3D by Vconf -m prep SDfile
Find this compound or compounds like it in BindingDB:
Activity Spreadsheet -- Enzyme Inhibition Constant Data from BindingDB
Found 8 hits for monomerid = 281338
TargetTyrosine-protein kinase JAK1(Homo sapiens (Human))
Pfizer
US Patent
LigandPNGBDBM281338(N-[2-({[6-(2-ethyl-5-fluoro-4-hydroxyphenyl)-1H-py...)
Affinity DataIC50:  55.3nMpH: 7.4 T: 2°C. Assay description: Test article was solubilized in dimethyl sulfoxide (DMSO) to a stock concentration of 30 mM. An 11-point half log dilution series was created in DMSO...
Ligand InfoPC cidPC sid
In DepthDetails US Patent
TargetTyrosine-protein kinase JAK2(Homo sapiens (Human))
Pfizer
US Patent
LigandPNGBDBM281338(N-[2-({[6-(2-ethyl-5-fluoro-4-hydroxyphenyl)-1H-py...)
Affinity DataIC50:  70.7nMpH: 7.4 T: 2°C. Assay description: Test article was solubilized in dimethyl sulfoxide (DMSO) to a stock concentration of 30 mM. An 11-point half log dilution series was created in DMSO...
Ligand InfoPC cidPC sid
In DepthDetails US Patent
TargetTyrosine-protein kinase JAK3(Homo sapiens (Human))
Pfizer
US Patent
LigandPNGBDBM281338(N-[2-({[6-(2-ethyl-5-fluoro-4-hydroxyphenyl)-1H-py...)
Affinity DataIC50:  186nMpH: 7.4 T: 2°C. Assay description: Test article was solubilized in dimethyl sulfoxide (DMSO) to a stock concentration of 30 mM. An 11-point half log dilution series was created in DMSO...
Ligand InfoPC cidPC sid
In DepthDetails US Patent
TargetNon-receptor tyrosine-protein kinase TYK2(Homo sapiens (Human))
Pfizer
US Patent
LigandPNGBDBM281338(N-[2-({[6-(2-ethyl-5-fluoro-4-hydroxyphenyl)-1H-py...)
Affinity DataIC50:  8.73E+3nMpH: 7.4 T: 2°C. Assay description: Test article was solubilized in dimethyl sulfoxide (DMSO) to a stock concentration of 30 mM. An 11-point half log dilution series was created in DMSO...
Ligand InfoPC cidPC sid
In DepthDetails US Patent
TargetTyrosine-protein kinase JAK1(Homo sapiens (Human))
Pfizer
US Patent
LigandPNGBDBM281338(N-[2-({[6-(2-ethyl-5-fluoro-4-hydroxyphenyl)-1H-py...)
Affinity DataIC50:  55.3nMpH: 7.4 T: 2°C. Assay description: Test article was solubilized in dimethyl sulfoxide (DMSO) to a stock concentration of 30 mM. An 11-point half log dilution series was created in DMSO...
Ligand InfoPC cidPC sid
In DepthDetails US Patent
TargetTyrosine-protein kinase JAK2(Homo sapiens (Human))
Pfizer
US Patent
LigandPNGBDBM281338(N-[2-({[6-(2-ethyl-5-fluoro-4-hydroxyphenyl)-1H-py...)
Affinity DataIC50:  70.7nMpH: 7.4 T: 2°C. Assay description: Test article was solubilized in dimethyl sulfoxide (DMSO) to a stock concentration of 30 mM. An 11-point half log dilution series was created in DMSO...
Ligand InfoPC cidPC sid
In DepthDetails US Patent
TargetTyrosine-protein kinase JAK3(Homo sapiens (Human))
Pfizer
US Patent
LigandPNGBDBM281338(N-[2-({[6-(2-ethyl-5-fluoro-4-hydroxyphenyl)-1H-py...)
Affinity DataIC50:  186nMpH: 7.4 T: 2°C. Assay description: Test article was solubilized in dimethyl sulfoxide (DMSO) to a stock concentration of 30 mM. An 11-point half log dilution series was created in DMSO...
Ligand InfoPC cidPC sid
In DepthDetails US Patent
TargetNon-receptor tyrosine-protein kinase TYK2(Homo sapiens (Human))
Pfizer
US Patent
LigandPNGBDBM281338(N-[2-({[6-(2-ethyl-5-fluoro-4-hydroxyphenyl)-1H-py...)
Affinity DataIC50:  8.73E+3nMpH: 7.4 T: 2°C. Assay description: Test article was solubilized in dimethyl sulfoxide (DMSO) to a stock concentration of 30 mM. An 11-point half log dilution series was created in DMSO...
Ligand InfoPC cidPC sid
In DepthDetails US Patent