BDBM281564 US10022461, Compound 15
SMILES Oc1ccc2cc(ncc2c1)-n1ccc2ccncc12
InChI Key InChIKey=BZWFCQHIHDMIAF-UHFFFAOYSA-N
Data  1 KI
  Tab Delimited (TSV)   2D SDfile   Computed 3D by Vconf -m prep SDfile
Find this compound or compounds like it in BindingDB:
Activity Spreadsheet -- Enzyme Inhibition Constant Data from BindingDB
Found 1 hit for monomerid = 281564
TargetMicrotubule-associated protein tau(Homo sapiens (Human))
Merck Sharp & Dohme
US Patent
LigandPNGBDBM281564(US10022461, Compound 15)
Affinity DataKi:  0.530nM ΔG°:  -12.6kcal/molepH: 7.4 T: 2°C. Assay description: For displacement tau binding assay, unlabeled test compounds were dissolved in DMSO at 1 mM. Dilutions of tests compounds to various concentrations w...
Ligand InfoPC cidPC sid
In DepthDetails US Patent