BDBM2816 Alkenyldiarylmethane (ADAM) 13b::Alkenyldiarylmethanes (ADAM) 13b::Methyl 6-[4-methoxy-5-(methoxycarbonyl)-3-methylphenyl]-6-oxohexanoate::methyl 2-methoxy-5-(6-methoxy-6-oxohexanoyl)-3-methylbenzoate
SMILES COC(=O)CCCCC(=O)c1cc(C)c(OC)c(c1)C(=O)OC
InChI Key InChIKey=JFJAUPAQHVOBMD-UHFFFAOYSA-N
Data  1 IC50
  Tab Delimited (TSV)   2D SDfile   Computed 3D by Vconf -m prep SDfile
Find this compound or compounds like it in BindingDB:
Activity Spreadsheet -- Enzyme Inhibition Constant Data from BindingDB
Found 1 hit for monomerid = 2816
TargetGag-Pol polyprotein [588-1027]/[588-1147](Human immunodeficiency virus type 1)
Purdue University
LigandPNGBDBM2816(Alkenyldiarylmethane (ADAM) 13b | Alkenyldiarylmet...)
Affinity DataIC50:  1.00E+5nMpH: 7.9Assay Description:The IC50 of reverse transcriptase is the concentration that inhibits 50% of recombinant HIV-1 RT RNA-directed DNA polymerase activity in vitro.
In DepthDetails ArticlePubMed