BDBM281762 4-(2-acryloyl-1,2,3,4- tetrahydroisoquinolin- 5-yl)-3-fluoro-9H- carbazole-1- carboxamide::US10023534, Example 30
SMILES NC(=O)c1cc(Cl)c(-c2cccc3CN(CCc23)C(=O)C=C)c2c3ccccc3[nH]c12
InChI Key InChIKey=HDEWPPNPDPMPSC-UHFFFAOYSA-N
Data  1 IC50
  Tab Delimited (TSV)   2D SDfile   Computed 3D by Vconf -m prep SDfile
Find this compound or compounds like it in BindingDB:
Activity Spreadsheet -- Enzyme Inhibition Constant Data from BindingDB
Found 1 hit for monomerid = 281762
TargetTyrosine-protein kinase BTK(Homo sapiens (Human))
Bristol-Myers Squibb
US Patent
LigandPNGBDBM281762(4-(2-acryloyl-1,2,3,4- tetrahydroisoquinolin- 5-yl...)
Affinity DataIC50:  0.000300nMpH: 7.4 T: 2°C. Assay description: To V-bottom 384-well plates were added test compounds, human recombinant Btk (1 nM, Invitrogen Corporation), fluoresceinated peptide (1.5 μM), A...
Ligand InfoPC cidPC sid
In DepthDetails US Patent